{"text_format":"1","workbook":"xlsx","n_sheets":3,"sheets":["TOOL","Daten Lagefaktor","Daten Bewohnerstruktur"],"not_rendered":{"charts":0,"images":6,"macros":0,"external_links":0,"defined_names":6,"comments":0,"pivot_tables":0},"unopened":[],"bounds":{"document_bytes":16777216,"sheet_cells":100000,"rows_first":2000,"rows_last":500,"rows_between":2000,"halvings":0,"cell_chars":16384,"cell_head_chars":4096},"cells_cut":0,"cells_raw":0,"read":"whole","date_system":"1900"}

{"sheet":"TOOL","index":0,"n_rows":149,"n_cols":25,"rows_kept":149,"cut":false,"hidden":false,"merged":[[41,20,41,22],[62,20,62,22],[118,26,118,27],[135,4,135,7],[25,7,26,22],[27,7,28,22],[117,5,123,22],[127,5,134,22],[138,5,143,22],[148,5,154,22],[77,7,79,22],[80,7,81,22],[136,4,136,7],[135,8,135,29],[136,8,136,29]]}
[]
[null,null,null,"E-Quartiere-Mobilitätstypologien"]
[]
[null,null,null,"Berechnungstool Dimensionierungsempfehlung Carsharing-Standorte"]
[]
[null,null,null,"Felder mit anzupassenden Annahmen, bei Anwahl der Zellen erscheint ein Infotext"]
[]
[]
[null,null,null,"Lage",null,null,{"$f":"SUM(G16,G26:G29)","v":0}]
[]
[]
[null,null,null,"Bestehende Rahmenbedingungen"]
[]
[null,null,null,null,"Statistisches Gebiet",null,"Faktor"]
[]
[null,null,null,null,null,null,{"$f":"IFERROR((VLOOKUP(E16,'Daten Lagefaktor'!D4:E945,2,FALSE)),\"\")","v":""},null,{"$f":"IFERROR((VLOOKUP(E16,'Daten Lagefaktor'!D4:H945,4,FALSE)),\"\")","v":""}]
[]
[null,null,null,null,"Hier klicken, um die Nummer des Statistischen Gebietes herauszufinden"]
[]
[]
[]
[null,null,null,"Geplante Rahmenbedingungen"]
[]
[null,null,null,null,"Geplante Maßnahmen"]
[]
[null,null,null,null,null,null,{"$f":"IFERROR((VLOOKUP(E26,'Daten Lagefaktor'!$J$3:$K$7,2,FALSE)),0)","v":0},{"$f":"IF(G9<=100,\"ACHTUNG: Das ausgewählte Statistische Gebiet hat einen unterdurchschnittlichen Lagefaktor, wodurch die Implementierung einer Carsharing-Station ohne weitere Maßnahmen nur bedingt sinnvoll ist.\",\"\")","v":"ACHTUNG: Das ausgewählte Statistische Gebiet hat einen unterdurchschnittlichen Lagefaktor, wodurch die Implementierung einer Carsharing-Station ohne weitere Maßnahmen nur bedingt sinnvoll ist."}]
[null,null,null,null,null,null,{"$f":"IFERROR((VLOOKUP(E27,'Daten Lagefaktor'!$J$3:$K$7,2,FALSE)),0)","v":0}]
[null,null,null,null,null,null,{"$f":"IFERROR((VLOOKUP(E28,'Daten Lagefaktor'!$J$3:$K$7,2,FALSE)),0)","v":0},{"$f":"IF(G9<=100,\"Denken Sie darüber nach, weitere geplante Maßnahmen zu ergreifen und diese unter Geplante Rahmenbedingungen zu bestimmen.\",\"\")","v":"Denken Sie darüber nach, weitere geplante Maßnahmen zu ergreifen und diese unter Geplante Rahmenbedingungen zu bestimmen."}]
[null,null,null,null,null,null,{"$f":"IFERROR((VLOOKUP(E29,'Daten Lagefaktor'!$J$3:$K$7,2,FALSE)),0)","v":0}]
[]
[]
[]
[]
[]
[]
[]
[null,null,null,"Bevölkerungsstruktur",null,null,{"$f":"SUM(X57,X70)","v":0},"CS-Fz. bei 15 Nutzern je CS-Fz.",null,null,null,null,{"$f":"SUM(Y57,Y70)","v":0},"CS-Fz. bei 45 Nutzern je CS-Fz."]
[]
[]
[null,null,null,"Typische Wohnformen "]
[]
[null,null,null,null,"Anzahl der Wohneinheiten ",null,"Wohnungsgröße",null,"Wohnungstyp",null,null,"Belegungsdichte",null,null,"Haushalts-typ",null,"Anzahl Einwohner",null,"Anteil CS-Nutzer",null,"Nutzer je CS-Fz."]
[]
[null,null,null,null,0,null,"1-2 Zimmer-Wohnung (< 60 m²)",{"$f":"IFERROR((VLOOKUP(G44,'Daten Bewohnerstruktur'!$B$3:$C$8,2,FALSE)),\"\")","v":1},"Gefördert",{"$f":"IFERROR((VLOOKUP(I44,'Daten Bewohnerstruktur'!$F$3:$G$6,2,FALSE)),\"\")","v":10},{"$f":"SUM(H44,J44)","v":11},{"$f":"IFERROR((VLOOKUP(K44,'Daten Bewohnerstruktur'!$J$4:$K$18,2,FALSE)),\"\")","v":1.5},{"$f":"IFERROR((VLOOKUP(K44,'Daten Bewohnerstruktur'!$J$4:$L$18,3,FALSE)),\"\")","v":"Personen"},null,{"$f":"IFERROR((VLOOKUP(L44,'Daten Bewohnerstruktur'!$M$4:$N$15,2,FALSE)),\"\")","v":"Paar"},{"$f":"IFERROR((VLOOKUP(O44,'Daten Bewohnerstruktur'!$N$4:$O$14,2,FALSE)),\"\")","v":2},{"$f":"IFERROR(((SUM(E44*L44))),\"\")","v":0},{"$f":"SUM(P44,J44)","v":12},{"$f":"IFERROR(((VLOOKUP(R44,'Daten Bewohnerstruktur'!$Q$3:$R$12,2,FALSE))),\"\")","v":2.4E-2},null,{"$f":"IFERROR(((VLOOKUP(R44,'Daten Bewohnerstruktur'!$Q$3:$U$12,3,FALSE))),\"\")","v":15},{"$f":"IFERROR(((VLOOKUP(R44,'Daten Bewohnerstruktur'!$Q$3:$U$12,4,FALSE))),\"\")","v":"-"},{"$f":"IFERROR(((VLOOKUP(R44,'Daten Bewohnerstruktur'!$Q$3:$U$12,5,FALSE))),\"\")","v":45},{"$f":"IFERROR(((SUM(Q44*S44/U44))),\"\")","v":0},{"$f":"IFERROR(((SUM(Q44*S44/W44))),\"\")","v":0}]
[null,null,null,null,0,null,"3 Zimmer-Wohnung (60 - 85 m²)",{"$f":"IFERROR((VLOOKUP(G45,'Daten Bewohnerstruktur'!$B$3:$C$8,2,FALSE)),\"\")","v":2},"Gefördert",{"$f":"IFERROR((VLOOKUP(I45,'Daten Bewohnerstruktur'!$F$3:$G$6,2,FALSE)),\"\")","v":10},{"$f":"SUM(H45,J45)","v":12},{"$f":"IFERROR((VLOOKUP(K45,'Daten Bewohnerstruktur'!$J$4:$K$18,2,FALSE)),\"\")","v":2.2000000000000002},{"$f":"IFERROR((VLOOKUP(K45,'Daten Bewohnerstruktur'!$J$4:$L$18,3,FALSE)),\"\")","v":"Personen"},null,{"$f":"IFERROR((VLOOKUP(L45,'Daten Bewohnerstruktur'!$M$4:$N$15,2,FALSE)),\"\")","v":"Paar"},{"$f":"IFERROR((VLOOKUP(O45,'Daten Bewohnerstruktur'!$N$4:$O$14,2,FALSE)),\"\")","v":2},{"$f":"IFERROR(((SUM(E45*L45))),\"\")","v":0},{"$f":"SUM(P45,J45)","v":12},{"$f":"IFERROR(((VLOOKUP(R45,'Daten Bewohnerstruktur'!$Q$3:$R$12,2,FALSE))),\"\")","v":2.4E-2},null,{"$f":"IFERROR(((VLOOKUP(R45,'Daten Bewohnerstruktur'!$Q$3:$U$12,3,FALSE))),\"\")","v":15},{"$f":"IFERROR(((VLOOKUP(R45,'Daten Bewohnerstruktur'!$Q$3:$U$12,4,FALSE))),\"\")","v":"-"},{"$f":"IFERROR(((VLOOKUP(R45,'Daten Bewohnerstruktur'!$Q$3:$U$12,5,FALSE))),\"\")","v":45},{"$f":"IFERROR(((SUM(Q45*S45/U45))),\"\")","v":0},{"$f":"IFERROR(((SUM(Q45*S45/W45))),\"\")","v":0}]
[null,null,null,null,0,null,"4 Zimmer-Wohnung (85 - 95 m²)",{"$f":"IFERROR((VLOOKUP(G46,'Daten Bewohnerstruktur'!$B$3:$C$8,2,FALSE)),\"\")","v":3},"Gefördert",{"$f":"IFERROR((VLOOKUP(I46,'Daten Bewohnerstruktur'!$F$3:$G$6,2,FALSE)),\"\")","v":10},13,{"$f":"IFERROR((VLOOKUP(K46,'Daten Bewohnerstruktur'!$J$4:$K$18,2,FALSE)),\"\")","v":3.7},{"$f":"IFERROR((VLOOKUP(K46,'Daten Bewohnerstruktur'!$J$4:$L$18,3,FALSE)),\"\")","v":"Personen"},null,{"$f":"IFERROR((VLOOKUP(L46,'Daten Bewohnerstruktur'!$M$4:$N$15,2,FALSE)),\"\")","v":"Familie"},{"$f":"IFERROR((VLOOKUP(O46,'Daten Bewohnerstruktur'!$N$4:$O$14,2,FALSE)),\"\")","v":3},0,13,{"$f":"IFERROR(((VLOOKUP(R46,'Daten Bewohnerstruktur'!$Q$3:$R$12,2,FALSE))),\"\")","v":1.4999999999999999E-2},null,{"$f":"IFERROR(((VLOOKUP(R46,'Daten Bewohnerstruktur'!$Q$3:$U$12,3,FALSE))),\"\")","v":15},{"$f":"IFERROR(((VLOOKUP(R46,'Daten Bewohnerstruktur'!$Q$3:$U$12,4,FALSE))),\"\")","v":"-"},{"$f":"IFERROR(((VLOOKUP(R46,'Daten Bewohnerstruktur'!$Q$3:$U$12,5,FALSE))),\"\")","v":45},0,0]
[null,null,null,null,0,null,"5 (+) Zimmer-Wohnung (> 105 m²)",{"$f":"IFERROR((VLOOKUP(G47,'Daten Bewohnerstruktur'!$B$3:$C$8,2,FALSE)),\"\")","v":4},"Gefördert",{"$f":"IFERROR((VLOOKUP(I47,'Daten Bewohnerstruktur'!$F$3:$G$6,2,FALSE)),\"\")","v":10},14,{"$f":"IFERROR((VLOOKUP(K47,'Daten Bewohnerstruktur'!$J$4:$K$18,2,FALSE)),\"\")","v":5.2},{"$f":"IFERROR((VLOOKUP(K47,'Daten Bewohnerstruktur'!$J$4:$L$18,3,FALSE)),\"\")","v":"Personen"},null,{"$f":"IFERROR((VLOOKUP(L47,'Daten Bewohnerstruktur'!$M$4:$N$15,2,FALSE)),\"\")","v":"Familie"},{"$f":"IFERROR((VLOOKUP(O47,'Daten Bewohnerstruktur'!$N$4:$O$14,2,FALSE)),\"\")","v":3},0,13,{"$f":"IFERROR(((VLOOKUP(R47,'Daten Bewohnerstruktur'!$Q$3:$R$12,2,FALSE))),\"\")","v":1.4999999999999999E-2},null,{"$f":"IFERROR(((VLOOKUP(R47,'Daten Bewohnerstruktur'!$Q$3:$U$12,3,FALSE))),\"\")","v":15},{"$f":"IFERROR(((VLOOKUP(R47,'Daten Bewohnerstruktur'!$Q$3:$U$12,4,FALSE))),\"\")","v":"-"},{"$f":"IFERROR(((VLOOKUP(R47,'Daten Bewohnerstruktur'!$Q$3:$U$12,5,FALSE))),\"\")","v":45},0,0]
[null,null,null,null,0,null,"1-2 Zimmer-Wohnung (< 60 m²)",{"$f":"IFERROR((VLOOKUP(G48,'Daten Bewohnerstruktur'!$B$3:$C$8,2,FALSE)),\"\")","v":1},"Frei finanziert",{"$f":"IFERROR((VLOOKUP(I48,'Daten Bewohnerstruktur'!$F$3:$G$6,2,FALSE)),\"\")","v":20},21,{"$f":"IFERROR((VLOOKUP(K48,'Daten Bewohnerstruktur'!$J$4:$K$18,2,FALSE)),\"\")","v":1.3},{"$f":"IFERROR((VLOOKUP(K48,'Daten Bewohnerstruktur'!$J$4:$L$18,3,FALSE)),\"\")","v":"Personen"},null,{"$f":"IFERROR((VLOOKUP(L48,'Daten Bewohnerstruktur'!$M$4:$N$15,2,FALSE)),\"\")","v":"Single"},{"$f":"IFERROR((VLOOKUP(O48,'Daten Bewohnerstruktur'!$N$4:$O$14,2,FALSE)),\"\")","v":1},0,21,{"$f":"IFERROR(((VLOOKUP(R48,'Daten Bewohnerstruktur'!$Q$3:$R$12,2,FALSE))),\"\")","v":8.7000000000000008E-2},null,{"$f":"IFERROR(((VLOOKUP(R48,'Daten Bewohnerstruktur'!$Q$3:$U$12,3,FALSE))),\"\")","v":15},{"$f":"IFERROR(((VLOOKUP(R48,'Daten Bewohnerstruktur'!$Q$3:$U$12,4,FALSE))),\"\")","v":"-"},{"$f":"IFERROR(((VLOOKUP(R48,'Daten Bewohnerstruktur'!$Q$3:$U$12,5,FALSE))),\"\")","v":45},0,0]
[null,null,null,null,0,null,"3 Zimmer-Wohnung (60 - 85 m²)",{"$f":"IFERROR((VLOOKUP(G49,'Daten Bewohnerstruktur'!$B$3:$C$8,2,FALSE)),\"\")","v":2},"Frei finanziert",{"$f":"IFERROR((VLOOKUP(I49,'Daten Bewohnerstruktur'!$F$3:$G$6,2,FALSE)),\"\")","v":20},22,{"$f":"IFERROR((VLOOKUP(K49,'Daten Bewohnerstruktur'!$J$4:$K$18,2,FALSE)),\"\")","v":1.9},{"$f":"IFERROR((VLOOKUP(K49,'Daten Bewohnerstruktur'!$J$4:$L$18,3,FALSE)),\"\")","v":"Personen"},null,{"$f":"IFERROR((VLOOKUP(L49,'Daten Bewohnerstruktur'!$M$4:$N$15,2,FALSE)),\"\")","v":"Paar"},{"$f":"IFERROR((VLOOKUP(O49,'Daten Bewohnerstruktur'!$N$4:$O$14,2,FALSE)),\"\")","v":2},0,22,{"$f":"IFERROR(((VLOOKUP(R49,'Daten Bewohnerstruktur'!$Q$3:$R$12,2,FALSE))),\"\")","v":8.0000000000000016E-2},null,{"$f":"IFERROR(((VLOOKUP(R49,'Daten Bewohnerstruktur'!$Q$3:$U$12,3,FALSE))),\"\")","v":15},{"$f":"IFERROR(((VLOOKUP(R49,'Daten Bewohnerstruktur'!$Q$3:$U$12,4,FALSE))),\"\")","v":"-"},{"$f":"IFERROR(((VLOOKUP(R49,'Daten Bewohnerstruktur'!$Q$3:$U$12,5,FALSE))),\"\")","v":45},0,0]
[null,null,null,null,0,null,"4 Zimmer-Wohnung (85 - 95 m²)",{"$f":"IFERROR((VLOOKUP(G50,'Daten Bewohnerstruktur'!$B$3:$C$8,2,FALSE)),\"\")","v":3},"Frei finanziert",{"$f":"IFERROR((VLOOKUP(I50,'Daten Bewohnerstruktur'!$F$3:$G$6,2,FALSE)),\"\")","v":20},23,{"$f":"IFERROR((VLOOKUP(K50,'Daten Bewohnerstruktur'!$J$4:$K$18,2,FALSE)),\"\")","v":3.2},{"$f":"IFERROR((VLOOKUP(K50,'Daten Bewohnerstruktur'!$J$4:$L$18,3,FALSE)),\"\")","v":"Personen"},null,{"$f":"IFERROR((VLOOKUP(L50,'Daten Bewohnerstruktur'!$M$4:$N$15,2,FALSE)),\"\")","v":"Familie"},{"$f":"IFERROR((VLOOKUP(O50,'Daten Bewohnerstruktur'!$N$4:$O$14,2,FALSE)),\"\")","v":3},0,23,{"$f":"IFERROR(((VLOOKUP(R50,'Daten Bewohnerstruktur'!$Q$3:$R$12,2,FALSE))),\"\")","v":0.05},null,{"$f":"IFERROR(((VLOOKUP(R50,'Daten Bewohnerstruktur'!$Q$3:$U$12,3,FALSE))),\"\")","v":15},{"$f":"IFERROR(((VLOOKUP(R50,'Daten Bewohnerstruktur'!$Q$3:$U$12,4,FALSE))),\"\")","v":"-"},{"$f":"IFERROR(((VLOOKUP(R50,'Daten Bewohnerstruktur'!$Q$3:$U$12,5,FALSE))),\"\")","v":45},0,0]
[null,null,null,null,0,null,"5 (+) Zimmer-Wohnung (> 105 m²)",{"$f":"IFERROR((VLOOKUP(G51,'Daten Bewohnerstruktur'!$B$3:$C$8,2,FALSE)),\"\")","v":4},"Frei finanziert",{"$f":"IFERROR((VLOOKUP(I51,'Daten Bewohnerstruktur'!$F$3:$G$6,2,FALSE)),\"\")","v":20},24,{"$f":"IFERROR((VLOOKUP(K51,'Daten Bewohnerstruktur'!$J$4:$K$18,2,FALSE)),\"\")","v":4.5},{"$f":"IFERROR((VLOOKUP(K51,'Daten Bewohnerstruktur'!$J$4:$L$18,3,FALSE)),\"\")","v":"Personen"},null,{"$f":"IFERROR((VLOOKUP(L51,'Daten Bewohnerstruktur'!$M$4:$N$15,2,FALSE)),\"\")","v":"Familie"},{"$f":"IFERROR((VLOOKUP(O51,'Daten Bewohnerstruktur'!$N$4:$O$14,2,FALSE)),\"\")","v":3},0,23,{"$f":"IFERROR(((VLOOKUP(R51,'Daten Bewohnerstruktur'!$Q$3:$R$12,2,FALSE))),\"\")","v":0.05},null,{"$f":"IFERROR(((VLOOKUP(R51,'Daten Bewohnerstruktur'!$Q$3:$U$12,3,FALSE))),\"\")","v":15},{"$f":"IFERROR(((VLOOKUP(R51,'Daten Bewohnerstruktur'!$Q$3:$U$12,4,FALSE))),\"\")","v":"-"},{"$f":"IFERROR(((VLOOKUP(R51,'Daten Bewohnerstruktur'!$Q$3:$U$12,5,FALSE))),\"\")","v":45},0,0]
[null,null,null,null,0,null,"1-2 Zimmer-Wohnung (< 60 m²)",{"$f":"IFERROR((VLOOKUP(G52,'Daten Bewohnerstruktur'!$B$3:$C$8,2,FALSE)),\"\")","v":1},"Eigentum",{"$f":"IFERROR((VLOOKUP(I52,'Daten Bewohnerstruktur'!$F$3:$G$6,2,FALSE)),\"\")","v":30},31,{"$f":"IFERROR((VLOOKUP(K52,'Daten Bewohnerstruktur'!$J$4:$K$18,2,FALSE)),\"\")","v":1},{"$f":"IFERROR((VLOOKUP(K52,'Daten Bewohnerstruktur'!$J$4:$L$18,3,FALSE)),\"\")","v":"Personen"},null,{"$f":"IFERROR((VLOOKUP(L52,'Daten Bewohnerstruktur'!$M$4:$N$15,2,FALSE)),\"\")","v":"Single"},{"$f":"IFERROR((VLOOKUP(O52,'Daten Bewohnerstruktur'!$N$4:$O$14,2,FALSE)),\"\")","v":1},0,31,{"$f":"IFERROR(((VLOOKUP(R52,'Daten Bewohnerstruktur'!$Q$3:$R$12,2,FALSE))),\"\")","v":8.7000000000000008E-2},null,{"$f":"IFERROR(((VLOOKUP(R52,'Daten Bewohnerstruktur'!$Q$3:$U$12,3,FALSE))),\"\")","v":15},{"$f":"IFERROR(((VLOOKUP(R52,'Daten Bewohnerstruktur'!$Q$3:$U$12,4,FALSE))),\"\")","v":"-"},{"$f":"IFERROR(((VLOOKUP(R52,'Daten Bewohnerstruktur'!$Q$3:$U$12,5,FALSE))),\"\")","v":45},0,0]
[null,null,null,null,0,null,"3 Zimmer-Wohnung (60 - 85 m²)",{"$f":"IFERROR((VLOOKUP(G53,'Daten Bewohnerstruktur'!$B$3:$C$8,2,FALSE)),\"\")","v":2},"Eigentum",{"$f":"IFERROR((VLOOKUP(I53,'Daten Bewohnerstruktur'!$F$3:$G$6,2,FALSE)),\"\")","v":30},32,{"$f":"IFERROR((VLOOKUP(K53,'Daten Bewohnerstruktur'!$J$4:$K$18,2,FALSE)),\"\")","v":1.5},{"$f":"IFERROR((VLOOKUP(K53,'Daten Bewohnerstruktur'!$J$4:$L$18,3,FALSE)),\"\")","v":"Personen"},null,{"$f":"IFERROR((VLOOKUP(L53,'Daten Bewohnerstruktur'!$M$4:$N$15,2,FALSE)),\"\")","v":"Paar"},{"$f":"IFERROR((VLOOKUP(O53,'Daten Bewohnerstruktur'!$N$4:$O$14,2,FALSE)),\"\")","v":2},0,32,{"$f":"IFERROR(((VLOOKUP(R53,'Daten Bewohnerstruktur'!$Q$3:$R$12,2,FALSE))),\"\")","v":8.0000000000000016E-2},null,{"$f":"IFERROR(((VLOOKUP(R53,'Daten Bewohnerstruktur'!$Q$3:$U$12,3,FALSE))),\"\")","v":15},{"$f":"IFERROR(((VLOOKUP(R53,'Daten Bewohnerstruktur'!$Q$3:$U$12,4,FALSE))),\"\")","v":"-"},{"$f":"IFERROR(((VLOOKUP(R53,'Daten Bewohnerstruktur'!$Q$3:$U$12,5,FALSE))),\"\")","v":45},0,0]
[null,null,null,null,0,null,"4 Zimmer-Wohnung (85 - 95 m²)",{"$f":"IFERROR((VLOOKUP(G54,'Daten Bewohnerstruktur'!$B$3:$C$8,2,FALSE)),\"\")","v":3},"Eigentum",{"$f":"IFERROR((VLOOKUP(I54,'Daten Bewohnerstruktur'!$F$3:$G$6,2,FALSE)),\"\")","v":30},33,{"$f":"IFERROR((VLOOKUP(K54,'Daten Bewohnerstruktur'!$J$4:$K$18,2,FALSE)),\"\")","v":2.5},{"$f":"IFERROR((VLOOKUP(K54,'Daten Bewohnerstruktur'!$J$4:$L$18,3,FALSE)),\"\")","v":"Personen"},null,{"$f":"IFERROR((VLOOKUP(L54,'Daten Bewohnerstruktur'!$M$4:$N$15,2,FALSE)),\"\")","v":"Familie"},{"$f":"IFERROR((VLOOKUP(O54,'Daten Bewohnerstruktur'!$N$4:$O$14,2,FALSE)),\"\")","v":3},0,33,{"$f":"IFERROR(((VLOOKUP(R54,'Daten Bewohnerstruktur'!$Q$3:$R$12,2,FALSE))),\"\")","v":0.05},null,{"$f":"IFERROR(((VLOOKUP(R54,'Daten Bewohnerstruktur'!$Q$3:$U$12,3,FALSE))),\"\")","v":15},{"$f":"IFERROR(((VLOOKUP(R54,'Daten Bewohnerstruktur'!$Q$3:$U$12,4,FALSE))),\"\")","v":"-"},{"$f":"IFERROR(((VLOOKUP(R54,'Daten Bewohnerstruktur'!$Q$3:$U$12,5,FALSE))),\"\")","v":45},0,0]
[null,null,null,null,0,null,"5 (+) Zimmer-Wohnung (> 105 m²)",{"$f":"IFERROR((VLOOKUP(G55,'Daten Bewohnerstruktur'!$B$3:$C$8,2,FALSE)),\"\")","v":4},"Eigentum",{"$f":"IFERROR((VLOOKUP(I55,'Daten Bewohnerstruktur'!$F$3:$G$6,2,FALSE)),\"\")","v":30},34,{"$f":"IFERROR((VLOOKUP(K55,'Daten Bewohnerstruktur'!$J$4:$K$18,2,FALSE)),\"\")","v":3.5},{"$f":"IFERROR((VLOOKUP(K55,'Daten Bewohnerstruktur'!$J$4:$L$18,3,FALSE)),\"\")","v":"Personen"},null,{"$f":"IFERROR((VLOOKUP(L55,'Daten Bewohnerstruktur'!$M$4:$N$15,2,FALSE)),\"\")","v":"Familie"},{"$f":"IFERROR((VLOOKUP(O55,'Daten Bewohnerstruktur'!$N$4:$O$14,2,FALSE)),\"\")","v":3},0,33,{"$f":"IFERROR(((VLOOKUP(R55,'Daten Bewohnerstruktur'!$Q$3:$R$12,2,FALSE))),\"\")","v":0.05},null,{"$f":"IFERROR(((VLOOKUP(R55,'Daten Bewohnerstruktur'!$Q$3:$U$12,3,FALSE))),\"\")","v":15},{"$f":"IFERROR(((VLOOKUP(R55,'Daten Bewohnerstruktur'!$Q$3:$U$12,4,FALSE))),\"\")","v":"-"},{"$f":"IFERROR(((VLOOKUP(R55,'Daten Bewohnerstruktur'!$Q$3:$U$12,5,FALSE))),\"\")","v":45},0,0]
[]
[null,null,null,"Summe",{"$f":"SUM(E44:E55)","v":0},null,null,null,null,null,null,null,null,null,null,null,{"$f":"SUM(Q44:Q55)","v":0},null,null,null,null,null,null,{"$f":"SUM(X44:X55)","v":0},{"$f":"SUM(Y44:Y55)","v":0}]
[]
[]
[]
{"$rows_left_out":90}
{"sheet":"Daten Lagefaktor","index":1,"n_rows":945,"n_cols":11,"rows_kept":945,"cut":false,"hidden":true,"merged":[]}
[]
[null,null,null,"Statistisches Gebiet","Lagefaktor","EW/ha","EW/600m Radius",null,null,"Maßnahme geplante Rahmenbedingungen","Faktor"]
[null,null,null,null,0,0,{"$f":"SUM(F3*50)","v":0},null,null,null,0]
[null,null,null,"1001 Hamburg-Altstadt",146.5957722733757,14.59,{"$f":"SUM(F4*50)","v":729.5},null,null,"zusätzliche ÖPNV-Haltestelle Bus (300m)",10]
[null,null,null,"1002 Hamburg-Altstadt",134.37945791726108,14.59,729.5,null,null,"zusätzliche ÖPNV-Haltestelle SPNV (500m)",30]
[null,null,null,"1003 Hamburg-Altstadt",146.5957722733757,14.59,729.5,null,null,"Supermarkt (500m)",20]
[null,null,null,"1004 Hamburg-Altstadt",146.5957722733757,14.59,729.5,null,null,"Erweiterung der free-floating Geschäftsgebiete",10]
[null,null,null,"1005 Hamburg-Altstadt",146.5957722733757,14.59,729.5]
[null,null,null,"1006 Hamburg-Altstadt",146.5957722733757,14.59,729.5]
[null,null,null,"1007 Hamburg-Altstadt",146.5957722733757,14.59,729.5]
[null,null,null,"1008 Hamburg-Altstadt",183.24471534171965,14.59,729.5]
[null,null,null,"1009 Hamburg-Altstadt",146.5957722733757,14.59,729.5]
[null,null,null,"1010 Hamburg-Altstadt",146.5957722733757,14.59,729.5]
[null,null,null,"2001 HafenCity",134.37945791726108,9.57,478.5]
[null,null,null,"2002 HafenCity",61.081571780573221,9.57,478.5]
[null,null,null,"3001 Neustadt",146.5957722733757,56.36,2818]
[null,null,null,"3002 Neustadt",158.81208662949035,56.36,2818]
[null,null,null,"3003 Neustadt",146.5957722733757,56.36,2818]
[null,null,null,"3004 Neustadt",146.5957722733757,56.36,2818]
[null,null,null,"3005 Neustadt",146.5957722733757,56.36,2818]
[null,null,null,"3006 Neustadt",183.24471534171965,56.36,2818]
[null,null,null,"3007 Neustadt",183.24471534171965,56.36,2818]
[null,null,null,"3008 Neustadt",158.81208662949035,56.36,2818]
[null,null,null,"3009 Neustadt",146.5957722733757,56.36,2818]
[null,null,null,"3010 Neustadt",183.24471534171965,56.36,2818]
[null,null,null,"3011 Neustadt",183.24471534171965,56.36,2818]
[null,null,null,"3012 Neustadt",183.24471534171965,56.36,2818]
[null,null,null,"3013 Neustadt",122.16314356114644,56.36,2818]
[null,null,null,"4001 St.Pauli",134.37945791726108,98.06,4903]
[null,null,null,"4002 St.Pauli",183.24471534171965,98.06,4903]
[null,null,null,"4003 St.Pauli",146.5957722733757,98.06,4903]
[null,null,null,"4004 St.Pauli",183.24471534171965,98.06,4903]
[null,null,null,"4005 St.Pauli",122.16314356114644,98.06,4903]
[null,null,null,"4006 St.Pauli",183.24471534171965,98.06,4903]
[null,null,null,"4007 St.Pauli",171.028400985605,98.06,4903]
[null,null,null,"4008 St.Pauli",171.028400985605,98.06,4903]
[null,null,null,"4009 St.Pauli",171.028400985605,98.06,4903]
[null,null,null,"4010 St.Pauli",134.37945791726108,98.06,4903]
[null,null,null,"5001 St.Georg",85.514200492802502,58.47,2923.5]
[null,null,null,"5002 St.Georg",171.028400985605,58.47,2923.5]
[null,null,null,"5003 St.Georg",134.37945791726108,58.47,2923.5]
[null,null,null,"5004 St.Georg",171.028400985605,58.47,2923.5]
[null,null,null,"5005 St.Georg",171.028400985605,58.47,2923.5]
[null,null,null,"5006 St.Georg",134.37945791726108,58.47,2923.5]
[null,null,null,"5007 St.Georg",183.24471534171965,58.47,2923.5]
[null,null,null,"5008 St.Georg",183.24471534171965,58.47,2923.5]
[null,null,null,"5009 St.Georg",146.5957722733757,58.47,2923.5]
[null,null,null,"6001 Hammerbrook",146.5957722733757,9.9600000000000009,498.00000000000006]
[null,null,null,"6002 Hammerbrook",73.29788613668785,9.9600000000000009,498.00000000000006]
[null,null,null,"6003 Hammerbrook",146.5957722733757,9.9600000000000009,498.00000000000006]
[null,null,null,"6004 Hammerbrook",109.94682920503178,9.9600000000000009,498.00000000000006]
[null,null,null,"6005 Hammerbrook",73.29788613668785,9.9600000000000009,498.00000000000006]
[null,null,null,"7001 Borgfelde",158.81208662949035,79.22,3961]
[null,null,null,"7002 Borgfelde",171.028400985605,79.22,3961]
[null,null,null,"7003 Borgfelde",158.81208662949035,79.22,3961]
[null,null,null,"8001 Hamm",171.028400985605,102.35,5117.5]
[null,null,null,"8002 Hamm",171.028400985605,102.35,5117.5]
[null,null,null,"8003 Hamm",171.028400985605,102.35,5117.5]
[null,null,null,"8004 Hamm",171.028400985605,102.35,5117.5]
[null,null,null,"8005 Hamm",158.81208662949035,102.35,5117.5]
{"$rows_left_out":886}
{"sheet":"Daten Bewohnerstruktur","index":2,"n_rows":26,"n_cols":23,"rows_kept":26,"cut":false,"hidden":true,"merged":[[27,5,27,11],[28,6,28,11],[1,12,1,13]]}
[]
[null,"Wohnungsgröße",null,"Durchschnittliche Bewohner",null,"Wohnungstyp","Code","Faktor",null,"Belegungsdichte",null,null,"Haushaltstyp",null,"Code",null,"Schlüssel Bewohner CS-Anteil",null,"Nutzer je CS-Fz",null,"Nutzer je CS-Fz","Potentialgruppe in Bezug auf Haushaltstyp","Anteil CS-Nutzer in Bezug auf Wohnungstyp"]
[null,null,0,0,null,null," "," ",null," "," ","Personen"," ",null," ",null," "," ",null,null," "]
[null,"1-2 Zimmer-Wohnung (< 60 m²)",1,1,null,"Gefördert",10,1.5,null,11,{"$f":"TRUNC(SUM(D4*$H$4),1)","v":1.5},"Personen",1,"Single",1,null,11,{"$f":"SUM(V4*W4*TOOL!G83)","v":2.6099999999999998E-2},15,"-",45,0.87,0.03]
[null,"3 Zimmer-Wohnung (60 - 85 m²)",2,1.5,null,"Frei finanziert",20,1.3,null,12,{"$f":"TRUNC(SUM(D5*$H$4),1)","v":2.2000000000000002},"Personen",1.3,"Single",1,null,12,{"$f":"SUM(V5*W5*TOOL!G83)","v":2.4E-2},15,"-",45,0.8,0.03]
[null,"4 Zimmer-Wohnung (85 - 95 m²)",3,2.5,null,"Eigentum",30,1,null,13,3.7,"Personen",1.5,"Paar",2,null,13,{"$f":"SUM(V6*W6*TOOL!G83)","v":1.4999999999999999E-2},15,"-",45,0.5,0.03]
[null,"5 (+) Zimmer-Wohnung (> 105 m²)",4,3.5,null,null,null,null,null,14,5.2,"Personen",1.9,"Paar",2,null,21,{"$f":"SUM(V7*W7*TOOL!G83)","v":8.7000000000000008E-2},15,"-",45,0.87,0.1]
[null,null,null,null,null,null,null,null,null,null,null,null,2.2000000000000002,"Paar",2,null,22,{"$f":"SUM(V8*W8*TOOL!G83)","v":8.0000000000000016E-2},15,"-",45,0.8,0.1]
[null,null,null,null,null,null,null,null,null,21,{"$f":"TRUNC(SUM(D4*$H$5),1)","v":1.3},"Personen",2.5,"Familie",3,null,23,{"$f":"SUM(V9*W9*TOOL!G83)","v":0.05},15,"-",45,0.5,0.1]
[null,null,null,null,null,null,null,null,null,22,{"$f":"TRUNC(SUM(D5*$H$5),1)","v":1.9},"Personen",3.2,"Familie",3,null,31,{"$f":"SUM(V10*W10*TOOL!G83)","v":8.7000000000000008E-2},15,"-",45,0.87,0.1]
[null,null,null,null,null,null,null,null,null,23,3.2,"Personen",3.5,"Familie",3,null,32,{"$f":"SUM(V11*W11*TOOL!G83)","v":8.0000000000000016E-2},15,"-",45,0.8,0.1]
[null,null,null,null,null,null,null,null,null,24,4.5,"Personen",3.7,"Familie",3,null,33,{"$f":"SUM(V12*W12*TOOL!G83)","v":0.05},15,"-",45,0.5,0.1]
[null,"Sonstiger Wohnungstyp","Schlüssel Bewohner",null,null,null,null,null,null,null,null,null,3.9,"Familie",3]
[null,null,null,null,null,null,null,null,null,31,{"$f":"TRUNC(SUM(D4*$H$6),1)","v":1},"Personen",4.5,"Familie",3]
[null,"Studentenwohnheim",0.2,15,"-",45,null,null,null,32,{"$f":"TRUNC(SUM(D5*$H$6),1)","v":1.5},"Personen",5.2,"Familie",3]
[null,"Kinder- und Jugendwohnheim",0,15,"-",45,null,null,null,33,2.5,"Personen"]
[null,"Altenwohnheim",5.0000000000000001E-3,15,"-",45,null,null,null,34,3.5,"Personen"]
[null,"Pflegeheim",0,15,"-",45]
[]
[]
[null,null,null,null,null,"Maßnahmen flankierende Maßnahmen","Faktor"]
[null,null,null,null,null,null,0]
[null,null,null,null,null,"Neubürgerpaket/Informationsleitsystem",0.3]
[null,null,null,null,null,"hochwertige Fahrradabstellanlagen",0.1]
[null,null,null,null,null,"Mobilitätsstation",0.2]
[null,null,null,null,null,"ergänzende StadtRad-Station",0.05]