{"text_format":"1","workbook":"xlsx","n_sheets":3,"sheets":["TOOL","Daten Lagefaktor","Daten Bewohnerstruktur"],"not_rendered":{"charts":0,"images":6,"macros":0,"external_links":0,"defined_names":6,"comments":0,"pivot_tables":0},"unopened":[],"bounds":{"document_bytes":16777216,"sheet_cells":100000,"rows_first":2000,"rows_last":500,"rows_between":2000,"halvings":0,"cell_chars":16384,"cell_head_chars":4096},"cells_cut":0,"cells_raw":0,"read":"whole","date_system":"1900"}

{"sheet":"TOOL","index":0,"n_rows":149,"n_cols":25,"rows_kept":149,"cut":false,"hidden":false,"merged":[[41,20,41,22],[62,20,62,22],[118,26,118,27],[135,4,135,7],[25,7,26,22],[27,7,28,22],[117,5,123,22],[127,5,134,22],[138,5,143,22],[148,5,154,22],[77,7,79,22],[80,7,81,22],[136,4,136,7],[135,8,135,29],[136,8,136,29]]}
[]
[null,null,null,"E-Quartiere-Mobilitätstypologien"]
[]
[null,null,null,"Berechnungstool Dimensionierungsempfehlung Carsharing-Standorte"]
[]
[null,null,null,"Felder mit anzupassenden Annahmen, bei Anwahl der Zellen erscheint ein Infotext"]
[]
[]
[null,null,null,"Lage",null,null,{"$f":"SUM(G16,G26:G29)","v":0}]
[]
[]
[null,null,null,"Bestehende Rahmenbedingungen"]
[]
[null,null,null,null,"Statistisches Gebiet",null,"Faktor"]
[]
[null,null,null,null,null,null,{"$f":"IFERROR((VLOOKUP(E16,'Daten Lagefaktor'!D4:E945,2,FALSE)),\"\")","v":""},null,{"$f":"IFERROR((VLOOKUP(E16,'Daten Lagefaktor'!D4:H945,4,FALSE)),\"\")","v":""}]
[]
[null,null,null,null,"Hier klicken, um die Nummer des Statistischen Gebietes herauszufinden"]
[]
[]
[]
[null,null,null,"Geplante Rahmenbedingungen"]
[]
[null,null,null,null,"Geplante Maßnahmen"]
[]
[null,null,null,null,null,null,{"$f":"IFERROR((VLOOKUP(E26,'Daten Lagefaktor'!$J$3:$K$7,2,FALSE)),0)","v":0},{"$f":"IF(G9<=100,\"ACHTUNG: Das ausgewählte Statistische Gebiet hat einen unterdurchschnittlichen Lagefaktor, wodurch die Implementierung einer Carsharing-Station ohne weitere Maßnahmen nur bedingt sinnvoll ist.\",\"\")","v":"ACHTUNG: Das ausgewählte Statistische Gebiet hat einen unterdurchschnittlichen Lagefaktor, wodurch die Implementierung einer Carsharing-Station ohne weitere Maßnahmen nur bedingt sinnvoll ist."}]
[null,null,null,null,null,null,{"$f":"IFERROR((VLOOKUP(E27,'Daten Lagefaktor'!$J$3:$K$7,2,FALSE)),0)","v":0}]
[null,null,null,null,null,null,{"$f":"IFERROR((VLOOKUP(E28,'Daten Lagefaktor'!$J$3:$K$7,2,FALSE)),0)","v":0},{"$f":"IF(G9<=100,\"Denken Sie darüber nach, weitere geplante Maßnahmen zu ergreifen und diese unter Geplante Rahmenbedingungen zu bestimmen.\",\"\")","v":"Denken Sie darüber nach, weitere geplante Maßnahmen zu ergreifen und diese unter Geplante Rahmenbedingungen zu bestimmen."}]
[null,null,null,null,null,null,{"$f":"IFERROR((VLOOKUP(E29,'Daten Lagefaktor'!$J$3:$K$7,2,FALSE)),0)","v":0}]
[]
[]
[]
[]
[]
[]
[]
[null,null,null,"Bevölkerungsstruktur",null,null,{"$f":"SUM(X57,X70)","v":0},"CS-Fz. bei 15 Nutzern je CS-Fz.",null,null,null,null,{"$f":"SUM(Y57,Y70)","v":0},"CS-Fz. bei 45 Nutzern je CS-Fz."]
[]
[]
[null,null,null,"Typische Wohnformen "]
[]
[null,null,null,null,"Anzahl der Wohneinheiten ",null,"Wohnungsgröße",null,"Wohnungstyp",null,null,"Belegungsdichte",null,null,"Haushalts-typ",null,"Anzahl Einwohner",null,"Anteil CS-Nutzer",null,"Nutzer je CS-Fz."]
[]
[null,null,null,null,0,null,"1-2 Zimmer-Wohnung (< 60 m²)",{"$f":"IFERROR((VLOOKUP(G44,'Daten Bewohnerstruktur'!$B$3:$C$8,2,FALSE)),\"\")","v":1},"Gefördert",{"$f":"IFERROR((VLOOKUP(I44,'Daten Bewohnerstruktur'!$F$3:$G$6,2,FALSE)),\"\")","v":10},{"$f":"SUM(H44,J44)","v":11},{"$f":"IFERROR((VLOOKUP(K44,'Daten Bewohnerstruktur'!$J$4:$K$18,2,FALSE)),\"\")","v":1.5},{"$f":"IFERROR((VLOOKUP(K44,'Daten Bewohnerstruktur'!$J$4:$L$18,3,FALSE)),\"\")","v":"Personen"},null,{"$f":"IFERROR((VLOOKUP(L44,'Daten Bewohnerstruktur'!$M$4:$N$15,2,FALSE)),\"\")","v":"Paar"},{"$f":"IFERROR((VLOOKUP(O44,'Daten Bewohnerstruktur'!$N$4:$O$14,2,FALSE)),\"\")","v":2},{"$f":"IFERROR(((SUM(E44*L44))),\"\")","v":0},{"$f":"SUM(P44,J44)","v":12},{"$f":"IFERROR(((VLOOKUP(R44,'Daten Bewohnerstruktur'!$Q$3:$R$12,2,FALSE))),\"\")","v":2.4E-2},null,{"$f":"IFERROR(((VLOOKUP(R44,'Daten Bewohnerstruktur'!$Q$3:$U$12,3,FALSE))),\"\")","v":15},{"$f":"IFERROR(((VLOOKUP(R44,'Daten Bewohnerstruktur'!$Q$3:$U$12,4,FALSE))),\"\")","v":"-"},{"$f":"IFERROR(((VLOOKUP(R44,'Daten Bewohnerstruktur'!$Q$3:$U$12,5,FALSE))),\"\")","v":45},{"$f":"IFERROR(((SUM(Q44*S44/U44))),\"\")","v":0},{"$f":"IFERROR(((SUM(Q44*S44/W44))),\"\")","v":0}]
[null,null,null,null,0,null,"3 Zimmer-Wohnung (60 - 85 m²)",{"$f":"IFERROR((VLOOKUP(G45,'Daten Bewohnerstruktur'!$B$3:$C$8,2,FALSE)),\"\")","v":2},"Gefördert",{"$f":"IFERROR((VLOOKUP(I45,'Daten Bewohnerstruktur'!$F$3:$G$6,2,FALSE)),\"\")","v":10},{"$f":"SUM(H45,J45)","v":12},{"$f":"IFERROR((VLOOKUP(K45,'Daten Bewohnerstruktur'!$J$4:$K$18,2,FALSE)),\"\")","v":2.2000000000000002},{"$f":"IFERROR((VLOOKUP(K45,'Daten Bewohnerstruktur'!$J$4:$L$18,3,FALSE)),\"\")","v":"Personen"},null,{"$f":"IFERROR((VLOOKUP(L45,'Daten Bewohnerstruktur'!$M$4:$N$15,2,FALSE)),\"\")","v":"Paar"},{"$f":"IFERROR((VLOOKUP(O45,'Daten Bewohnerstruktur'!$N$4:$O$14,2,FALSE)),\"\")","v":2},{"$f":"IFERROR(((SUM(E45*L45))),\"\")","v":0},{"$f":"SUM(P45,J45)","v":12},{"$f":"IFERROR(((VLOOKUP(R45,'Daten Bewohnerstruktur'!$Q$3:$R$12,2,FALSE))),\"\")","v":2.4E-2},null,{"$f":"IFERROR(((VLOOKUP(R45,'Daten Bewohnerstruktur'!$Q$3:$U$12,3,FALSE))),\"\")","v":15},{"$f":"IFERROR(((VLOOKUP(R45,'Daten Bewohnerstruktur'!$Q$3:$U$12,4,FALSE))),\"\")","v":"-"},{"$f":"IFERROR(((VLOOKUP(R45,'Daten Bewohnerstruktur'!$Q$3:$U$12,5,FALSE))),\"\")","v":45},{"$f":"IFERROR(((SUM(Q45*S45/U45))),\"\")","v":0},{"$f":"IFERROR(((SUM(Q45*S45/W45))),\"\")","v":0}]
[null,null,null,null,0,null,"4 Zimmer-Wohnung (85 - 95 m²)",{"$f":"IFERROR((VLOOKUP(G46,'Daten Bewohnerstruktur'!$B$3:$C$8,2,FALSE)),\"\")","v":3},"Gefördert",{"$f":"IFERROR((VLOOKUP(I46,'Daten Bewohnerstruktur'!$F$3:$G$6,2,FALSE)),\"\")","v":10},13,{"$f":"IFERROR((VLOOKUP(K46,'Daten Bewohnerstruktur'!$J$4:$K$18,2,FALSE)),\"\")","v":3.7},{"$f":"IFERROR((VLOOKUP(K46,'Daten Bewohnerstruktur'!$J$4:$L$18,3,FALSE)),\"\")","v":"Personen"},null,{"$f":"IFERROR((VLOOKUP(L46,'Daten Bewohnerstruktur'!$M$4:$N$15,2,FALSE)),\"\")","v":"Familie"},{"$f":"IFERROR((VLOOKUP(O46,'Daten Bewohnerstruktur'!$N$4:$O$14,2,FALSE)),\"\")","v":3},0,13,{"$f":"IFERROR(((VLOOKUP(R46,'Daten Bewohnerstruktur'!$Q$3:$R$12,2,FALSE))),\"\")","v":1.4999999999999999E-2},null,{"$f":"IFERROR(((VLOOKUP(R46,'Daten Bewohnerstruktur'!$Q$3:$U$12,3,FALSE))),\"\")","v":15},{"$f":"IFERROR(((VLOOKUP(R46,'Daten Bewohnerstruktur'!$Q$3:$U$12,4,FALSE))),\"\")","v":"-"},{"$f":"IFERROR(((VLOOKUP(R46,'Daten Bewohnerstruktur'!$Q$3:$U$12,5,FALSE))),\"\")","v":45},0,0]
[null,null,null,null,0,null,"5 (+) Zimmer-Wohnung (> 105 m²)",{"$f":"IFERROR((VLOOKUP(G47,'Daten Bewohnerstruktur'!$B$3:$C$8,2,FALSE)),\"\")","v":4},"Gefördert",{"$f":"IFERROR((VLOOKUP(I47,'Daten Bewohnerstruktur'!$F$3:$G$6,2,FALSE)),\"\")","v":10},14,{"$f":"IFERROR((VLOOKUP(K47,'Daten Bewohnerstruktur'!$J$4:$K$18,2,FALSE)),\"\")","v":5.2},{"$f":"IFERROR((VLOOKUP(K47,'Daten Bewohnerstruktur'!$J$4:$L$18,3,FALSE)),\"\")","v":"Personen"},null,{"$f":"IFERROR((VLOOKUP(L47,'Daten Bewohnerstruktur'!$M$4:$N$15,2,FALSE)),\"\")","v":"Familie"},{"$f":"IFERROR((VLOOKUP(O47,'Daten Bewohnerstruktur'!$N$4:$O$14,2,FALSE)),\"\")","v":3},0,13,{"$f":"IFERROR(((VLOOKUP(R47,'Daten Bewohnerstruktur'!$Q$3:$R$12,2,FALSE))),\"\")","v":1.4999999999999999E-2},null,{"$f":"IFERROR(((VLOOKUP(R47,'Daten Bewohnerstruktur'!$Q$3:$U$12,3,FALSE))),\"\")","v":15},{"$f":"IFERROR(((VLOOKUP(R47,'Daten Bewohnerstruktur'!$Q$3:$U$12,4,FALSE))),\"\")","v":"-"},{"$f":"IFERROR(((VLOOKUP(R47,'Daten Bewohnerstruktur'!$Q$3:$U$12,5,FALSE))),\"\")","v":45},0,0]
[null,null,null,null,0,null,"1-2 Zimmer-Wohnung (< 60 m²)",{"$f":"IFERROR((VLOOKUP(G48,'Daten Bewohnerstruktur'!$B$3:$C$8,2,FALSE)),\"\")","v":1},"Frei finanziert",{"$f":"IFERROR((VLOOKUP(I48,'Daten Bewohnerstruktur'!$F$3:$G$6,2,FALSE)),\"\")","v":20},21,{"$f":"IFERROR((VLOOKUP(K48,'Daten Bewohnerstruktur'!$J$4:$K$18,2,FALSE)),\"\")","v":1.3},{"$f":"IFERROR((VLOOKUP(K48,'Daten Bewohnerstruktur'!$J$4:$L$18,3,FALSE)),\"\")","v":"Personen"},null,{"$f":"IFERROR((VLOOKUP(L48,'Daten Bewohnerstruktur'!$M$4:$N$15,2,FALSE)),\"\")","v":"Single"},{"$f":"IFERROR((VLOOKUP(O48,'Daten Bewohnerstruktur'!$N$4:$O$14,2,FALSE)),\"\")","v":1},0,21,{"$f":"IFERROR(((VLOOKUP(R48,'Daten Bewohnerstruktur'!$Q$3:$R$12,2,FALSE))),\"\")","v":8.7000000000000008E-2},null,{"$f":"IFERROR(((VLOOKUP(R48,'Daten Bewohnerstruktur'!$Q$3:$U$12,3,FALSE))),\"\")","v":15},{"$f":"IFERROR(((VLOOKUP(R48,'Daten Bewohnerstruktur'!$Q$3:$U$12,4,FALSE))),\"\")","v":"-"},{"$f":"IFERROR(((VLOOKUP(R48,'Daten Bewohnerstruktur'!$Q$3:$U$12,5,FALSE))),\"\")","v":45},0,0]
[null,null,null,null,0,null,"3 Zimmer-Wohnung (60 - 85 m²)",{"$f":"IFERROR((VLOOKUP(G49,'Daten Bewohnerstruktur'!$B$3:$C$8,2,FALSE)),\"\")","v":2},"Frei finanziert",{"$f":"IFERROR((VLOOKUP(I49,'Daten Bewohnerstruktur'!$F$3:$G$6,2,FALSE)),\"\")","v":20},22,{"$f":"IFERROR((VLOOKUP(K49,'Daten Bewohnerstruktur'!$J$4:$K$18,2,FALSE)),\"\")","v":1.9},{"$f":"IFERROR((VLOOKUP(K49,'Daten Bewohnerstruktur'!$J$4:$L$18,3,FALSE)),\"\")","v":"Personen"},null,{"$f":"IFERROR((VLOOKUP(L49,'Daten Bewohnerstruktur'!$M$4:$N$15,2,FALSE)),\"\")","v":"Paar"},{"$f":"IFERROR((VLOOKUP(O49,'Daten Bewohnerstruktur'!$N$4:$O$14,2,FALSE)),\"\")","v":2},0,22,{"$f":"IFERROR(((VLOOKUP(R49,'Daten Bewohnerstruktur'!$Q$3:$R$12,2,FALSE))),\"\")","v":8.0000000000000016E-2},null,{"$f":"IFERROR(((VLOOKUP(R49,'Daten Bewohnerstruktur'!$Q$3:$U$12,3,FALSE))),\"\")","v":15},{"$f":"IFERROR(((VLOOKUP(R49,'Daten Bewohnerstruktur'!$Q$3:$U$12,4,FALSE))),\"\")","v":"-"},{"$f":"IFERROR(((VLOOKUP(R49,'Daten Bewohnerstruktur'!$Q$3:$U$12,5,FALSE))),\"\")","v":45},0,0]
[null,null,null,null,0,null,"4 Zimmer-Wohnung (85 - 95 m²)",{"$f":"IFERROR((VLOOKUP(G50,'Daten Bewohnerstruktur'!$B$3:$C$8,2,FALSE)),\"\")","v":3},"Frei finanziert",{"$f":"IFERROR((VLOOKUP(I50,'Daten Bewohnerstruktur'!$F$3:$G$6,2,FALSE)),\"\")","v":20},23,{"$f":"IFERROR((VLOOKUP(K50,'Daten Bewohnerstruktur'!$J$4:$K$18,2,FALSE)),\"\")","v":3.2},{"$f":"IFERROR((VLOOKUP(K50,'Daten Bewohnerstruktur'!$J$4:$L$18,3,FALSE)),\"\")","v":"Personen"},null,{"$f":"IFERROR((VLOOKUP(L50,'Daten Bewohnerstruktur'!$M$4:$N$15,2,FALSE)),\"\")","v":"Familie"},{"$f":"IFERROR((VLOOKUP(O50,'Daten Bewohnerstruktur'!$N$4:$O$14,2,FALSE)),\"\")","v":3},0,23,{"$f":"IFERROR(((VLOOKUP(R50,'Daten Bewohnerstruktur'!$Q$3:$R$12,2,FALSE))),\"\")","v":0.05},null,{"$f":"IFERROR(((VLOOKUP(R50,'Daten Bewohnerstruktur'!$Q$3:$U$12,3,FALSE))),\"\")","v":15},{"$f":"IFERROR(((VLOOKUP(R50,'Daten Bewohnerstruktur'!$Q$3:$U$12,4,FALSE))),\"\")","v":"-"},{"$f":"IFERROR(((VLOOKUP(R50,'Daten Bewohnerstruktur'!$Q$3:$U$12,5,FALSE))),\"\")","v":45},0,0]
[null,null,null,null,0,null,"5 (+) Zimmer-Wohnung (> 105 m²)",{"$f":"IFERROR((VLOOKUP(G51,'Daten Bewohnerstruktur'!$B$3:$C$8,2,FALSE)),\"\")","v":4},"Frei finanziert",{"$f":"IFERROR((VLOOKUP(I51,'Daten Bewohnerstruktur'!$F$3:$G$6,2,FALSE)),\"\")","v":20},24,{"$f":"IFERROR((VLOOKUP(K51,'Daten Bewohnerstruktur'!$J$4:$K$18,2,FALSE)),\"\")","v":4.5},{"$f":"IFERROR((VLOOKUP(K51,'Daten Bewohnerstruktur'!$J$4:$L$18,3,FALSE)),\"\")","v":"Personen"},null,{"$f":"IFERROR((VLOOKUP(L51,'Daten Bewohnerstruktur'!$M$4:$N$15,2,FALSE)),\"\")","v":"Familie"},{"$f":"IFERROR((VLOOKUP(O51,'Daten Bewohnerstruktur'!$N$4:$O$14,2,FALSE)),\"\")","v":3},0,23,{"$f":"IFERROR(((VLOOKUP(R51,'Daten Bewohnerstruktur'!$Q$3:$R$12,2,FALSE))),\"\")","v":0.05},null,{"$f":"IFERROR(((VLOOKUP(R51,'Daten Bewohnerstruktur'!$Q$3:$U$12,3,FALSE))),\"\")","v":15},{"$f":"IFERROR(((VLOOKUP(R51,'Daten Bewohnerstruktur'!$Q$3:$U$12,4,FALSE))),\"\")","v":"-"},{"$f":"IFERROR(((VLOOKUP(R51,'Daten Bewohnerstruktur'!$Q$3:$U$12,5,FALSE))),\"\")","v":45},0,0]
[null,null,null,null,0,null,"1-2 Zimmer-Wohnung (< 60 m²)",{"$f":"IFERROR((VLOOKUP(G52,'Daten Bewohnerstruktur'!$B$3:$C$8,2,FALSE)),\"\")","v":1},"Eigentum",{"$f":"IFERROR((VLOOKUP(I52,'Daten Bewohnerstruktur'!$F$3:$G$6,2,FALSE)),\"\")","v":30},31,{"$f":"IFERROR((VLOOKUP(K52,'Daten Bewohnerstruktur'!$J$4:$K$18,2,FALSE)),\"\")","v":1},{"$f":"IFERROR((VLOOKUP(K52,'Daten Bewohnerstruktur'!$J$4:$L$18,3,FALSE)),\"\")","v":"Personen"},null,{"$f":"IFERROR((VLOOKUP(L52,'Daten Bewohnerstruktur'!$M$4:$N$15,2,FALSE)),\"\")","v":"Single"},{"$f":"IFERROR((VLOOKUP(O52,'Daten Bewohnerstruktur'!$N$4:$O$14,2,FALSE)),\"\")","v":1},0,31,{"$f":"IFERROR(((VLOOKUP(R52,'Daten Bewohnerstruktur'!$Q$3:$R$12,2,FALSE))),\"\")","v":8.7000000000000008E-2},null,{"$f":"IFERROR(((VLOOKUP(R52,'Daten Bewohnerstruktur'!$Q$3:$U$12,3,FALSE))),\"\")","v":15},{"$f":"IFERROR(((VLOOKUP(R52,'Daten Bewohnerstruktur'!$Q$3:$U$12,4,FALSE))),\"\")","v":"-"},{"$f":"IFERROR(((VLOOKUP(R52,'Daten Bewohnerstruktur'!$Q$3:$U$12,5,FALSE))),\"\")","v":45},0,0]
[null,null,null,null,0,null,"3 Zimmer-Wohnung (60 - 85 m²)",{"$f":"IFERROR((VLOOKUP(G53,'Daten Bewohnerstruktur'!$B$3:$C$8,2,FALSE)),\"\")","v":2},"Eigentum",{"$f":"IFERROR((VLOOKUP(I53,'Daten Bewohnerstruktur'!$F$3:$G$6,2,FALSE)),\"\")","v":30},32,{"$f":"IFERROR((VLOOKUP(K53,'Daten Bewohnerstruktur'!$J$4:$K$18,2,FALSE)),\"\")","v":1.5},{"$f":"IFERROR((VLOOKUP(K53,'Daten Bewohnerstruktur'!$J$4:$L$18,3,FALSE)),\"\")","v":"Personen"},null,{"$f":"IFERROR((VLOOKUP(L53,'Daten Bewohnerstruktur'!$M$4:$N$15,2,FALSE)),\"\")","v":"Paar"},{"$f":"IFERROR((VLOOKUP(O53,'Daten Bewohnerstruktur'!$N$4:$O$14,2,FALSE)),\"\")","v":2},0,32,{"$f":"IFERROR(((VLOOKUP(R53,'Daten Bewohnerstruktur'!$Q$3:$R$12,2,FALSE))),\"\")","v":8.0000000000000016E-2},null,{"$f":"IFERROR(((VLOOKUP(R53,'Daten Bewohnerstruktur'!$Q$3:$U$12,3,FALSE))),\"\")","v":15},{"$f":"IFERROR(((VLOOKUP(R53,'Daten Bewohnerstruktur'!$Q$3:$U$12,4,FALSE))),\"\")","v":"-"},{"$f":"IFERROR(((VLOOKUP(R53,'Daten Bewohnerstruktur'!$Q$3:$U$12,5,FALSE))),\"\")","v":45},0,0]
[null,null,null,null,0,null,"4 Zimmer-Wohnung (85 - 95 m²)",{"$f":"IFERROR((VLOOKUP(G54,'Daten Bewohnerstruktur'!$B$3:$C$8,2,FALSE)),\"\")","v":3},"Eigentum",{"$f":"IFERROR((VLOOKUP(I54,'Daten Bewohnerstruktur'!$F$3:$G$6,2,FALSE)),\"\")","v":30},33,{"$f":"IFERROR((VLOOKUP(K54,'Daten Bewohnerstruktur'!$J$4:$K$18,2,FALSE)),\"\")","v":2.5},{"$f":"IFERROR((VLOOKUP(K54,'Daten Bewohnerstruktur'!$J$4:$L$18,3,FALSE)),\"\")","v":"Personen"},null,{"$f":"IFERROR((VLOOKUP(L54,'Daten Bewohnerstruktur'!$M$4:$N$15,2,FALSE)),\"\")","v":"Familie"},{"$f":"IFERROR((VLOOKUP(O54,'Daten Bewohnerstruktur'!$N$4:$O$14,2,FALSE)),\"\")","v":3},0,33,{"$f":"IFERROR(((VLOOKUP(R54,'Daten Bewohnerstruktur'!$Q$3:$R$12,2,FALSE))),\"\")","v":0.05},null,{"$f":"IFERROR(((VLOOKUP(R54,'Daten Bewohnerstruktur'!$Q$3:$U$12,3,FALSE))),\"\")","v":15},{"$f":"IFERROR(((VLOOKUP(R54,'Daten Bewohnerstruktur'!$Q$3:$U$12,4,FALSE))),\"\")","v":"-"},{"$f":"IFERROR(((VLOOKUP(R54,'Daten Bewohnerstruktur'!$Q$3:$U$12,5,FALSE))),\"\")","v":45},0,0]
[null,null,null,null,0,null,"5 (+) Zimmer-Wohnung (> 105 m²)",{"$f":"IFERROR((VLOOKUP(G55,'Daten Bewohnerstruktur'!$B$3:$C$8,2,FALSE)),\"\")","v":4},"Eigentum",{"$f":"IFERROR((VLOOKUP(I55,'Daten Bewohnerstruktur'!$F$3:$G$6,2,FALSE)),\"\")","v":30},34,{"$f":"IFERROR((VLOOKUP(K55,'Daten Bewohnerstruktur'!$J$4:$K$18,2,FALSE)),\"\")","v":3.5},{"$f":"IFERROR((VLOOKUP(K55,'Daten Bewohnerstruktur'!$J$4:$L$18,3,FALSE)),\"\")","v":"Personen"},null,{"$f":"IFERROR((VLOOKUP(L55,'Daten Bewohnerstruktur'!$M$4:$N$15,2,FALSE)),\"\")","v":"Familie"},{"$f":"IFERROR((VLOOKUP(O55,'Daten Bewohnerstruktur'!$N$4:$O$14,2,FALSE)),\"\")","v":3},0,33,{"$f":"IFERROR(((VLOOKUP(R55,'Daten Bewohnerstruktur'!$Q$3:$R$12,2,FALSE))),\"\")","v":0.05},null,{"$f":"IFERROR(((VLOOKUP(R55,'Daten Bewohnerstruktur'!$Q$3:$U$12,3,FALSE))),\"\")","v":15},{"$f":"IFERROR(((VLOOKUP(R55,'Daten Bewohnerstruktur'!$Q$3:$U$12,4,FALSE))),\"\")","v":"-"},{"$f":"IFERROR(((VLOOKUP(R55,'Daten Bewohnerstruktur'!$Q$3:$U$12,5,FALSE))),\"\")","v":45},0,0]
[]
[null,null,null,"Summe",{"$f":"SUM(E44:E55)","v":0},null,null,null,null,null,null,null,null,null,null,null,{"$f":"SUM(Q44:Q55)","v":0},null,null,null,null,null,null,{"$f":"SUM(X44:X55)","v":0},{"$f":"SUM(Y44:Y55)","v":0}]
[]
[]
[]
[null,null,null,"Sonderwohnformen"]
[]
[null,null,null,null,"Anzahl der Einwohner ",null,"Wohnungstyp",null,null,null,null,null,null,null,null,null,null,null,"Anteil CS-Nutzer",null,"Nutzer je CS-Fz."]
[]
[null,null,null,null,0,null,"Studentenwohnheim",null,null,null,null,null,null,null,null,null,null,null,{"$f":"IFERROR(((VLOOKUP(G65,'Daten Bewohnerstruktur'!B15:C18,2,FALSE))),\"\")","v":0.2},null,{"$f":"IFERROR(((VLOOKUP(S65,'Daten Bewohnerstruktur'!$C$15:$F$18,2,FALSE))),\"\")","v":15},{"$f":"IFERROR(((VLOOKUP(S65,'Daten Bewohnerstruktur'!$C$15:$F$18,3,FALSE))),\"\")","v":"-"},{"$f":"IFERROR(((VLOOKUP(S65,'Daten Bewohnerstruktur'!$C$15:$F$18,4,FALSE))),\"\")","v":45},null,{"$f":"IFERROR(((SUM(E65*S65/U65))),\"\")","v":0}]
[null,null,null,null,0,null,"Kinder- und Jugendwohnheim",null,null,null,null,null,null,null,null,null,null,null,{"$f":"IFERROR(((VLOOKUP(G66,'Daten Bewohnerstruktur'!B16:C19,2,FALSE))),\"\")","v":0},null,{"$f":"IFERROR(((VLOOKUP(S66,'Daten Bewohnerstruktur'!$C$15:$F$18,2,FALSE))),\"\")","v":15},{"$f":"IFERROR(((VLOOKUP(S66,'Daten Bewohnerstruktur'!$C$15:$F$18,3,FALSE))),\"\")","v":"-"},{"$f":"IFERROR(((VLOOKUP(S66,'Daten Bewohnerstruktur'!$C$15:$F$18,4,FALSE))),\"\")","v":45},null,{"$f":"IFERROR(((SUM(E66*S66/U66))),\"\")","v":0}]
[null,null,null,null,0,null,"Altenwohnheim",null,null,null,null,null,null,null,null,null,null,null,{"$f":"IFERROR(((VLOOKUP(G67,'Daten Bewohnerstruktur'!B17:C20,2,FALSE))),\"\")","v":5.0000000000000001E-3},null,{"$f":"IFERROR(((VLOOKUP(S67,'Daten Bewohnerstruktur'!$C$15:$F$18,2,FALSE))),\"\")","v":15},{"$f":"IFERROR(((VLOOKUP(S67,'Daten Bewohnerstruktur'!$C$15:$F$18,3,FALSE))),\"\")","v":"-"},{"$f":"IFERROR(((VLOOKUP(S67,'Daten Bewohnerstruktur'!$C$15:$F$18,4,FALSE))),\"\")","v":45},null,{"$f":"IFERROR(((SUM(E67*S67/U67))),\"\")","v":0}]
[null,null,null,null,0,null,"Pflegeheim",null,null,null,null,null,null,null,null,null,null,null,{"$f":"IFERROR(((VLOOKUP(G68,'Daten Bewohnerstruktur'!B18:C21,2,FALSE))),\"\")","v":0},null,{"$f":"IFERROR(((VLOOKUP(S68,'Daten Bewohnerstruktur'!$C$15:$F$18,2,FALSE))),\"\")","v":15},{"$f":"IFERROR(((VLOOKUP(S68,'Daten Bewohnerstruktur'!$C$15:$F$18,3,FALSE))),\"\")","v":"-"},{"$f":"IFERROR(((VLOOKUP(S68,'Daten Bewohnerstruktur'!$C$15:$F$18,4,FALSE))),\"\")","v":45},null,{"$f":"IFERROR(((SUM(E68*S68/U68))),\"\")","v":0}]
[]
[null,null,null,"Summe",{"$f":"SUM(E65:E68)","v":0},null,null,null,null,null,null,null,null,null,null,null,null,null,null,null,null,null,null,{"$f":"SUM(X65:X68)","v":0},{"$f":"SUM(Y65:Y68)","v":0}]
[]
[]
[]
[null,null,null,"Flankierende Maßnahmen"]
[]
[null,null,null,null,"Geplante Maßnahmen"]
[]
[null,null,null,null,null,null,{"$f":"IFERROR((VLOOKUP(E78,'Daten Bewohnerstruktur'!$F$22:$G$27,2,FALSE)),\"\")","v":""},"Denken Sie darüber nach weitere geplante Maßnahmen zu ergreifen und diese unter Flankierende Maßnahmen zu bestimmen. So können Sie den Anteil der Personen, die CS-Fahrzeuge nutzen, erhöhen."]
[null,null,null,null,null,null,{"$f":"IFERROR((VLOOKUP(E79,'Daten Bewohnerstruktur'!$F$22:$G$27,2,FALSE)),\"\")","v":""}]
[null,null,null,null,null,null,{"$f":"IFERROR((VLOOKUP(E80,'Daten Bewohnerstruktur'!$F$22:$G$27,2,FALSE)),\"\")","v":""}]
[null,null,null,null,null,null,null,"Weitere Informationen zu den Flankierenden Maßnahmen und ihren Potenzialen finden Sie weiter unten."]
[null,null,null,null,null,null,{"$f":"IFERROR((VLOOKUP(E82,'Daten Bewohnerstruktur'!$F$22:$G$27,2,FALSE)),\"\")","v":""}]
[null,null,null,null,null,null,{"$f":"SUM(G78:G82)+1","v":1}]
[]
[]
[]
[]
[]
[]
[null,null,null,"CS-Fahrzeuge"]
[]
[]
[null,null,null,"CS-Fahrzeuge nur für das Quartier"]
[]
[null,null,null,null,"Anzahl der CS-Fahrzeuge bei 15 Nutzern je Kfz",null,"Davon max. e-Fahrzeuge"]
[]
[null,null,null,null,{"$f":"TRUNC(SUM((G9/100)*G37))","v":0},null,{"$f":"IF(SUM(I97=E97),MAX(0,SUM(I97-1)),I97)","v":0},null,{"$f":"TRUNC(SUM(E97*0.85))","v":0}]
[]
[null,null,null,null,"Anzahl der CS-Fahrzeuge bei 45 Nutzern je Kfz",null,"Davon max. e-Fahrzeuge"]
[]
[null,null,null,null,{"$f":"SUM((G9/100)*M37)","v":0},null,{"$f":"IF(SUM(I101=E101),MAX(0,SUM(I101-1)),I101)","v":0},null,{"$f":"TRUNC(SUM(E101*0.85))","v":0}]
[]
[]
[]
[null,null,null,"CS-Fahrzeuge inklusive der Berücksichtigung der Umgebung (600m Einzugsradius)"]
[]
[null,null,null,null,"Anzahl der CS-Fahrzeuge bei 15 Nutzern je Kfz",null,"Davon max. e-Fahrzeuge"]
[]
[null,null,null,null,{"$f":"IFERROR((TRUNC(SUM((I16)*0.01*($G$9/100)/15)+E97)),\"0\")","v":"0"},null,{"$f":"IF(SUM(I109=E109),MAX(0,SUM(I109-1)),I109)","v":0},null,{"$f":"TRUNC(SUM(E109*0.85))","v":0}]
[]
[null,null,null,null,"Anzahl der CS-Fahrzeuge bei 45 Nutzern je Kfz",null,"Davon max. e-Fahrzeuge"]
[]
[null,null,null,null,{"$f":"IFERROR((TRUNC(SUM((I16)*0.01*($G$9/100)/45)+E101)),\"0\")","v":"0"},null,{"$f":"IF(SUM(I113=E113),MAX(0,SUM(I113-1)),I113)","v":0},null,{"$f":"TRUNC(SUM(E113*0.85))","v":0}]
[]
[]
[]
[]
[null,null,null,null,null,"Der Moment des Umzugs ist aufgrund der veränderten Wohnlage im Regelfall mit einem Überdenken des eigenen Mobilitätsverhaltens verbunden. Daher ist eine bewusste Unterstützung mit Informationen in diesen Momenten von besonderer Bedeutung. Durch gezieltes Marketing kann das Mobilitätsverhalten hierbei entscheidend beeinflusst werden."]
[]
[]
[]
[]
[]
[]
[]
[]
[]
[null,null,null,null,null,"Ein wesentlicher Baustein zur Erhöhung des Carsharing-Nutzeranteils im Quartier ist die Herstellung von qualitativ hochwertigen Fahrradabstellanlagen. Die einfache Zugänglichkeit von Fahrradabstellanlagen spielt bei der Verkehrsmittelwahl eine bedeutende Rolle, um das Fahrrad neben dem ÖPNV als Hauptverkehrsmittel zu etablieren. \nGrundsätzlich gilt es, die Abstellplätze den jeweiligen Hauseingängen zuzuweisen und im Optimalfall ebenerdig anfahrbar zu gestalten. So ergeben sich grundsätzlich vier mögliche Typologien für die privaten Fahrradabstellanlagen, die in dem Rechner berücksichtigt werden können: eigenständige Kubatur; architektonisch angedockt; in der Tiefgarage; im Baukörper integriert.\n"]
[]
[]
[]
[]
[]
[]
[]
[]
[]
[]
[null,null,null,null,null,"Um eine effiziente Mobilität in unterschiedlichen Lebens- und Alltagssituationen sicherzustellen, ist die Idee der Vernetzung unterschiedlicher Mobilitätsangebote ein naheliegender Lösungsansatz. Mobilitätsstationen sind dabei gewissermaßen als Verräumlichung einer multimodalen Mobilitätskultur zu sehen. Als Beispiel sind die in Hamburg erfolgreich implementierten „switchh“ Punkte zu nennen. \nIn Ergänzung zu den bislang etablierten intermodalen Stationen an S- und U-Bahnstationen können Mobilitätsstationen auch als Gegenstück am Start- und Zielpunkt gedacht werden. Im Umfeld des Quartiers beginnen bzw. enden der überwiegende Teil der Wege, weswegen sich derartige Quartiers-Mobilitätsstationen im kollektiven Bewusstsein zu einer potenziellen „Mobilitätsgarantie“ entwickeln könnten.\n"]
[]
[]
[]
[]
[]
[]
[]
[]
[]
[null,null,null,null,null,"Das Projekt StadtRAD wurde 2007 initiiert. Seit 2017 gibt es über 200 Fahrradstationen (vgl. StadtRad Hamburg 2016) die kontinuierlich räumlich erweitert werden. Die Stationen liegen insbesondere im innerstädtischen Bereich und an zentralen Umsteigepunkten des ÖPNV. Sie bieten eine schnelle und flexible Alternative im Verkehrsmittelmix und können das Verkehrsverhalten zu Gunsten einer nachhaltigen Mobilität beeinflussen.\nDie Finanzierung der Stationen erfolgt gewöhnlich seitens der Stadt Hamburg, während der Betrieb von der DB-Rent gewährleistet wird. Für den Bau weiterer Stationen müssen im Haushalt der Stadt entsprechende Gelder berücksichtigt werden. Alternativ sind z.B. private Finanzierungen möglich, mit denen die Herstellungs- und ggf. Betriebskosten abgedeckt werden können."]

{"sheet":"Daten Lagefaktor","index":1,"n_rows":945,"n_cols":11,"rows_kept":945,"cut":false,"hidden":true,"merged":[]}
[]
[null,null,null,"Statistisches Gebiet","Lagefaktor","EW/ha","EW/600m Radius",null,null,"Maßnahme geplante Rahmenbedingungen","Faktor"]
[null,null,null,null,0,0,{"$f":"SUM(F3*50)","v":0},null,null,null,0]
[null,null,null,"1001 Hamburg-Altstadt",146.5957722733757,14.59,{"$f":"SUM(F4*50)","v":729.5},null,null,"zusätzliche ÖPNV-Haltestelle Bus (300m)",10]
[null,null,null,"1002 Hamburg-Altstadt",134.37945791726108,14.59,729.5,null,null,"zusätzliche ÖPNV-Haltestelle SPNV (500m)",30]
[null,null,null,"1003 Hamburg-Altstadt",146.5957722733757,14.59,729.5,null,null,"Supermarkt (500m)",20]
[null,null,null,"1004 Hamburg-Altstadt",146.5957722733757,14.59,729.5,null,null,"Erweiterung der free-floating Geschäftsgebiete",10]
[null,null,null,"1005 Hamburg-Altstadt",146.5957722733757,14.59,729.5]
[null,null,null,"1006 Hamburg-Altstadt",146.5957722733757,14.59,729.5]
[null,null,null,"1007 Hamburg-Altstadt",146.5957722733757,14.59,729.5]
[null,null,null,"1008 Hamburg-Altstadt",183.24471534171965,14.59,729.5]
[null,null,null,"1009 Hamburg-Altstadt",146.5957722733757,14.59,729.5]
[null,null,null,"1010 Hamburg-Altstadt",146.5957722733757,14.59,729.5]
[null,null,null,"2001 HafenCity",134.37945791726108,9.57,478.5]
[null,null,null,"2002 HafenCity",61.081571780573221,9.57,478.5]
[null,null,null,"3001 Neustadt",146.5957722733757,56.36,2818]
[null,null,null,"3002 Neustadt",158.81208662949035,56.36,2818]
[null,null,null,"3003 Neustadt",146.5957722733757,56.36,2818]
[null,null,null,"3004 Neustadt",146.5957722733757,56.36,2818]
[null,null,null,"3005 Neustadt",146.5957722733757,56.36,2818]
[null,null,null,"3006 Neustadt",183.24471534171965,56.36,2818]
[null,null,null,"3007 Neustadt",183.24471534171965,56.36,2818]
[null,null,null,"3008 Neustadt",158.81208662949035,56.36,2818]
[null,null,null,"3009 Neustadt",146.5957722733757,56.36,2818]
[null,null,null,"3010 Neustadt",183.24471534171965,56.36,2818]
[null,null,null,"3011 Neustadt",183.24471534171965,56.36,2818]
[null,null,null,"3012 Neustadt",183.24471534171965,56.36,2818]
[null,null,null,"3013 Neustadt",122.16314356114644,56.36,2818]
[null,null,null,"4001 St.Pauli",134.37945791726108,98.06,4903]
[null,null,null,"4002 St.Pauli",183.24471534171965,98.06,4903]
[null,null,null,"4003 St.Pauli",146.5957722733757,98.06,4903]
[null,null,null,"4004 St.Pauli",183.24471534171965,98.06,4903]
[null,null,null,"4005 St.Pauli",122.16314356114644,98.06,4903]
[null,null,null,"4006 St.Pauli",183.24471534171965,98.06,4903]
[null,null,null,"4007 St.Pauli",171.028400985605,98.06,4903]
[null,null,null,"4008 St.Pauli",171.028400985605,98.06,4903]
[null,null,null,"4009 St.Pauli",171.028400985605,98.06,4903]
[null,null,null,"4010 St.Pauli",134.37945791726108,98.06,4903]
[null,null,null,"5001 St.Georg",85.514200492802502,58.47,2923.5]
[null,null,null,"5002 St.Georg",171.028400985605,58.47,2923.5]
[null,null,null,"5003 St.Georg",134.37945791726108,58.47,2923.5]
[null,null,null,"5004 St.Georg",171.028400985605,58.47,2923.5]
[null,null,null,"5005 St.Georg",171.028400985605,58.47,2923.5]
[null,null,null,"5006 St.Georg",134.37945791726108,58.47,2923.5]
[null,null,null,"5007 St.Georg",183.24471534171965,58.47,2923.5]
[null,null,null,"5008 St.Georg",183.24471534171965,58.47,2923.5]
[null,null,null,"5009 St.Georg",146.5957722733757,58.47,2923.5]
[null,null,null,"6001 Hammerbrook",146.5957722733757,9.9600000000000009,498.00000000000006]
[null,null,null,"6002 Hammerbrook",73.29788613668785,9.9600000000000009,498.00000000000006]
[null,null,null,"6003 Hammerbrook",146.5957722733757,9.9600000000000009,498.00000000000006]
[null,null,null,"6004 Hammerbrook",109.94682920503178,9.9600000000000009,498.00000000000006]
[null,null,null,"6005 Hammerbrook",73.29788613668785,9.9600000000000009,498.00000000000006]
[null,null,null,"7001 Borgfelde",158.81208662949035,79.22,3961]
[null,null,null,"7002 Borgfelde",171.028400985605,79.22,3961]
[null,null,null,"7003 Borgfelde",158.81208662949035,79.22,3961]
[null,null,null,"8001 Hamm",171.028400985605,102.35,5117.5]
[null,null,null,"8002 Hamm",171.028400985605,102.35,5117.5]
[null,null,null,"8003 Hamm",171.028400985605,102.35,5117.5]
[null,null,null,"8004 Hamm",171.028400985605,102.35,5117.5]
[null,null,null,"8005 Hamm",158.81208662949035,102.35,5117.5]
[null,null,null,"8006 Hamm",158.81208662949035,102.35,5117.5]
[null,null,null,"8007 Hamm",134.37945791726108,102.35,5117.5]
[null,null,null,"8008 Hamm",171.028400985605,102.35,5117.5]
[null,null,null,"8009 Hamm",158.81208662949035,102.35,5117.5]
[null,null,null,"9001 Hamm",158.81208662949035,102.35,5117.5]
[null,null,null,"9002 Hamm",158.81208662949035,102.35,5117.5]
[null,null,null,"9003 Hamm",171.028400985605,102.35,5117.5]
[null,null,null,"9004 Hamm",158.81208662949035,102.35,{"$f":"SUM(F68*50)","v":5117.5}]
[null,null,null,"9005 Hamm",158.81208662949035,102.35,5117.5]
[null,null,null,"10001 Hamm",48.865257424458569,102.35,5117.5]
[null,null,null,"10002 Hamm",73.29788613668785,102.35,5117.5]
[null,null,null,"10003 Hamm",48.865257424458569,102.35,5117.5]
[null,null,null,"11001 Horn",122.16314356114644,65.7,3285]
[null,null,null,"11002 Horn",109.94682920503178,65.7,3285]
[null,null,null,"11003 Horn",61.081571780573221,65.7,3285]
[null,null,null,"11004 Horn",85.514200492802502,65.7,3285]
[null,null,null,"11005 Horn",158.81208662949035,65.7,3285]
[null,null,null,"11006 Horn",158.81208662949035,65.7,3285]
[null,null,null,"11007 Horn",171.028400985605,65.7,3285]
[null,null,null,"11008 Horn",158.81208662949035,65.7,3285]
[null,null,null,"11009 Horn",171.028400985605,65.7,3285]
[null,null,null,"11010 Horn",158.81208662949035,65.7,3285]
[null,null,null,"11011 Horn",73.29788613668785,65.7,3285]
[null,null,null,"11012 Horn",146.5957722733757,65.7,3285]
[null,null,null,"11013 Horn",97.730514848917139,65.7,3285]
[null,null,null,"11014 Horn",146.5957722733757,65.7,3285]
[null,null,null,"11015 Horn",171.028400985605,65.7,3285]
[null,null,null,"11016 Horn",61.081571780573221,65.7,3285]
[null,null,null,"12001 Billstedt",85.514200492802502,41.62,2081]
[null,null,null,"12002 Billstedt",73.29788613668785,41.62,2081]
[null,null,null,"12003 Billstedt",73.29788613668785,41.62,2081]
[null,null,null,"12004 Billstedt",24.432628712229285,41.62,2081]
[null,null,null,"12005 Billstedt",73.29788613668785,41.62,2081]
[null,null,null,"12006 Billstedt",36.648943068343925,41.62,2081]
[null,null,null,"12007 Billstedt",134.37945791726108,41.62,2081]
[null,null,null,"12008 Billstedt",122.16314356114644,41.62,2081]
[null,null,null,"12009 Billstedt",85.514200492802502,41.62,2081]
[null,null,null,"12010 Billstedt",97.730514848917139,41.62,2081]
[null,null,null,"12011 Billstedt",122.16314356114644,41.62,2081]
[null,null,null,"12012 Billstedt",61.081571780573221,41.62,2081]
[null,null,null,"12013 Billstedt",109.94682920503178,41.62,2081]
[null,null,null,"12014 Billstedt",122.16314356114644,41.62,2081]
[null,null,null,"12015 Billstedt",109.94682920503178,41.62,2081]
[null,null,null,"12016 Billstedt",122.16314356114644,41.62,2081]
[null,null,null,"12017 Billstedt",109.94682920503178,41.62,2081]
[null,null,null,"12018 Billstedt",73.29788613668785,41.62,2081]
[null,null,null,"12019 Billstedt",122.16314356114644,41.62,2081]
[null,null,null,"12020 Billstedt",97.730514848917139,41.62,2081]
[null,null,null,"12021 Billstedt",48.865257424458569,41.62,2081]
[null,null,null,"12022 Billstedt",85.514200492802502,41.62,2081]
[null,null,null,"12023 Billstedt",134.37945791726108,41.62,2081]
[null,null,null,"12024 Billstedt",48.865257424458569,41.62,2081]
[null,null,null,"12025 Billstedt",24.432628712229285,41.62,2081]
[null,null,null,"12026 Billstedt",61.081571780573221,41.62,2081]
[null,null,null,"12027 Billstedt",134.37945791726108,41.62,2081]
[null,null,null,"12028 Billstedt",134.37945791726108,41.62,2081]
[null,null,null,"12029 Billstedt",134.37945791726108,41.62,2081]
[null,null,null,"13001 Billbrook",24.432628712229285,3.55,177.5]
[null,null,null,"13002 Billbrook",24.432628712229285,3.55,177.5]
[null,null,null,"14001 Rothenburgsort",24.432628712229285,12.4,620]
[null,null,null,"14002 Rothenburgsort",73.29788613668785,12.4,620]
[null,null,null,"14003 Rothenburgsort",122.16314356114644,12.4,620]
[null,null,null,"14004 Rothenburgsort",85.514200492802502,12.4,620]
[null,null,null,"14005 Rothenburgsort",48.865257424458569,12.4,620]
[null,null,null,"15001 Veddel",122.16314356114644,10.78,539]
[null,null,null,"15002 Veddel",24.432628712229285,10.78,539]
[null,null,null,"16001 Wilhelmsburg",24.432628712229285,15.25,762.5]
[null,null,null,"16002 Wilhelmsburg",12.216314356114642,15.25,762.5]
[null,null,null,"16003 Wilhelmsburg",48.865257424458569,15.25,762.5]
[null,null,null,"16004 Wilhelmsburg",134.37945791726108,15.25,762.5]
[null,null,null,"16005 Wilhelmsburg",61.081571780573221,15.25,762.5]
[null,null,null,"16006 Wilhelmsburg",24.432628712229285,15.25,{"$f":"SUM(F132*50)","v":762.5}]
[null,null,null,"16007 Wilhelmsburg",134.37945791726108,15.25,762.5]
[null,null,null,"16008 Wilhelmsburg",122.16314356114644,15.25,762.5]
[null,null,null,"16009 Wilhelmsburg",146.5957722733757,15.25,762.5]
[null,null,null,"16010 Wilhelmsburg",122.16314356114644,15.25,762.5]
[null,null,null,"16011 Wilhelmsburg",48.865257424458569,15.25,762.5]
[null,null,null,"16012 Wilhelmsburg",24.432628712229285,15.25,762.5]
[null,null,null,"16013 Wilhelmsburg",122.16314356114644,15.25,762.5]
[null,null,null,"16014 Wilhelmsburg",85.514200492802502,15.25,762.5]
[null,null,null,"16015 Wilhelmsburg",109.94682920503178,15.25,762.5]
[null,null,null,"16016 Wilhelmsburg",146.5957722733757,15.25,762.5]
[null,null,null,"16017 Wilhelmsburg",134.37945791726108,15.25,762.5]
[null,null,null,"16018 Wilhelmsburg",24.432628712229285,15.25,762.5]
[null,null,null,"16019 Wilhelmsburg",36.648943068343925,15.25,762.5]
[null,null,null,"16020 Wilhelmsburg",24.432628712229285,15.25,762.5]
[null,null,null,"16021 Wilhelmsburg",97.730514848917139,15.25,762.5]
[null,null,null,"16022 Wilhelmsburg",73.29788613668785,15.25,762.5]
[null,null,null,"16023 Wilhelmsburg",97.730514848917139,15.25,762.5]
[null,null,null,"16024 Wilhelmsburg",36.648943068343925,15.25,762.5]
[null,null,null,"17001 KleinerGrasbrook",24.432628712229285,1.1499999999999999,57.499999999999993]
[null,null,null,"17002 KleinerGrasbrook",48.865257424458569,1.1499999999999999,57.499999999999993]
[null,null,null,"17003 KleinerGrasbrook",48.865257424458569,1.1499999999999999,57.499999999999993]
[null,null,null,"18001 Steinwerder",12.216314356114642,1.1499999999999999,57.499999999999993]
[null,null,null,"18002 Steinwerder",12.216314356114642,1.1499999999999999,57.499999999999993]
[null,null,null,"18003 Steinwerder",24.432628712229285,1.1499999999999999,57.499999999999993]
[null,null,null,"19001 Waltershof",0,4.0999999999999996,204.99999999999997]
[null,null,null,"19002 Waltershof",0,4.0999999999999996,204.99999999999997]
[null,null,null,"19003 Waltershof",12.216314356114642,4.0999999999999996,204.99999999999997]
[null,null,null,"20001 Finkenwerder",12.216314356114642,4.0999999999999996,204.99999999999997]
[null,null,null,"20002 Finkenwerder",24.432628712229285,4.0999999999999996,204.99999999999997]
[null,null,null,"20003 Finkenwerder",48.865257424458569,4.0999999999999996,204.99999999999997]
[null,null,null,"20004 Finkenwerder",24.432628712229285,4.0999999999999996,204.99999999999997]
[null,null,null,"20005 Finkenwerder",36.648943068343925,4.0999999999999996,204.99999999999997]
[null,null,null,"20006 Finkenwerder",24.432628712229285,4.0999999999999996,204.99999999999997]
[null,null,null,"20007 Finkenwerder",48.865257424458569,4.0999999999999996,204.99999999999997]
[null,null,null,"20008 Finkenwerder",85.514200492802502,4.0999999999999996,204.99999999999997]
[null,null,null,"20009 Finkenwerder",73.29788613668785,4.0999999999999996,204.99999999999997]
[null,null,null,"21001 Altona-Altstadt",183.24471534171965,104.86,5243]
[null,null,null,"21002 Altona-Altstadt",158.81208662949035,104.86,5243]
[null,null,null,"21003 Altona-Altstadt",183.24471534171965,104.86,5243]
[null,null,null,"21004 Altona-Altstadt",146.5957722733757,104.86,5243]
[null,null,null,"21005 Altona-Altstadt",158.81208662949035,104.86,5243]
[null,null,null,"21006 Altona-Altstadt",158.81208662949035,104.86,5243]
[null,null,null,"21007 Altona-Altstadt",183.24471534171965,104.86,5243]
[null,null,null,"21008 Altona-Altstadt",183.24471534171965,104.86,5243]
[null,null,null,"21009 Altona-Altstadt",171.028400985605,104.86,5243]
[null,null,null,"21010 Altona-Altstadt",97.730514848917139,104.86,5243]
[null,null,null,"21011 Altona-Altstadt",171.028400985605,104.86,5243]
[null,null,null,"21012 Altona-Altstadt",122.16314356114644,104.86,5243]
[null,null,null,"22001 Sternschanze",158.81208662949035,143.21,7160.5]
[null,null,null,"22002 Sternschanze",183.24471534171965,143.21,7160.5]
[null,null,null,"22003 Sternschanze",183.24471534171965,143.21,7160.5]
[null,null,null,"22004 Sternschanze",146.5957722733757,143.21,7160.5]
[null,null,null,"23001 Altona-Nord",146.5957722733757,100.49,5024.5]
[null,null,null,"23002 Altona-Nord",183.24471534171965,100.49,5024.5]
[null,null,null,"23003 Altona-Nord",183.24471534171965,100.49,5024.5]
[null,null,null,"23004 Altona-Nord",183.24471534171965,100.49,5024.5]
[null,null,null,"23005 Altona-Nord",183.24471534171965,100.49,5024.5]
[null,null,null,"23006 Altona-Nord",183.24471534171965,100.49,5024.5]
[null,null,null,"23007 Altona-Nord",171.028400985605,100.49,5024.5]
[null,null,null,"23008 Altona-Nord",97.730514848917139,100.49,5024.5]
[null,null,null,"23009 Altona-Nord",171.028400985605,100.49,5024.5]
[null,null,null,"23010 Altona-Nord",183.24471534171965,100.49,5024.5]
[null,null,null,"23011 Altona-Nord",183.24471534171965,100.49,5024.5]
[null,null,null,"24001 Ottensen",183.24471534171965,122.99,{"$f":"SUM(F196*50)","v":6149.5}]
[null,null,null,"24002 Ottensen",134.37945791726108,122.99,6149.5]
[null,null,null,"24003 Ottensen",134.37945791726108,122.99,6149.5]
[null,null,null,"24004 Ottensen",146.5957722733757,122.99,6149.5]
[null,null,null,"24005 Ottensen",109.94682920503178,122.99,6149.5]
[null,null,null,"24006 Ottensen",109.94682920503178,122.99,6149.5]
[null,null,null,"24007 Ottensen",134.37945791726108,122.99,6149.5]
[null,null,null,"24008 Ottensen",158.81208662949035,122.99,6149.5]
[null,null,null,"24009 Ottensen",171.028400985605,122.99,6149.5]
[null,null,null,"24010 Ottensen",171.028400985605,122.99,6149.5]
[null,null,null,"24011 Ottensen",134.37945791726108,122.99,6149.5]
[null,null,null,"24012 Ottensen",134.37945791726108,122.99,6149.5]
[null,null,null,"24013 Ottensen",183.24471534171965,122.99,6149.5]
[null,null,null,"24014 Ottensen",158.81208662949035,122.99,6149.5]
[null,null,null,"24015 Ottensen",61.081571780573221,122.99,6149.5]
[null,null,null,"25001 Bahrenfeld",24.432628712229285,27.26,1363]
[null,null,null,"25002 Bahrenfeld",36.648943068343925,27.26,1363]
[null,null,null,"25003 Bahrenfeld",85.514200492802502,27.26,1363]
[null,null,null,"25004 Bahrenfeld",61.081571780573221,27.26,1363]
[null,null,null,"25005 Bahrenfeld",24.432628712229285,27.26,1363]
[null,null,null,"25006 Bahrenfeld",85.514200492802502,27.26,1363]
[null,null,null,"25007 Bahrenfeld",61.081571780573221,27.26,1363]
[null,null,null,"25008 Bahrenfeld",73.29788613668785,27.26,1363]
[null,null,null,"25009 Bahrenfeld",24.432628712229285,27.26,1363]
[null,null,null,"25010 Bahrenfeld",36.648943068343925,27.26,1363]
[null,null,null,"25011 Bahrenfeld",146.5957722733757,27.26,1363]
[null,null,null,"25012 Bahrenfeld",146.5957722733757,27.26,1363]
[null,null,null,"25013 Bahrenfeld",122.16314356114644,27.26,1363]
[null,null,null,"25014 Bahrenfeld",171.028400985605,27.26,1363]
[null,null,null,"25015 Bahrenfeld",171.028400985605,27.26,1363]
[null,null,null,"25016 Bahrenfeld",158.81208662949035,27.26,1363]
[null,null,null,"25017 Bahrenfeld",134.37945791726108,27.26,1363]
[null,null,null,"25018 Bahrenfeld",97.730514848917139,27.26,1363]
[null,null,null,"26001 GroßFlottbek",122.16314356114644,45.21,2260.5]
[null,null,null,"26002 GroßFlottbek",134.37945791726108,45.21,2260.5]
[null,null,null,"26003 GroßFlottbek",109.94682920503178,45.21,2260.5]
[null,null,null,"26004 GroßFlottbek",158.81208662949035,45.21,2260.5]
[null,null,null,"26005 GroßFlottbek",122.16314356114644,45.21,2260.5]
[null,null,null,"27001 Othmarschen",85.514200492802502,24.4,1220]
[null,null,null,"27002 Othmarschen",134.37945791726108,24.4,1220]
[null,null,null,"27003 Othmarschen",158.81208662949035,24.4,1220]
[null,null,null,"27004 Othmarschen",85.514200492802502,24.4,1220]
[null,null,null,"27005 Othmarschen",61.081571780573221,24.4,1220]
[null,null,null,"27006 Othmarschen",36.648943068343925,24.4,1220]
[null,null,null,"27007 Othmarschen",36.648943068343925,24.4,1220]
[null,null,null,"27008 Othmarschen",85.514200492802502,24.4,1220]
[null,null,null,"27009 Othmarschen",48.865257424458569,24.4,1220]
[null,null,null,"28001 Lurup",24.432628712229285,55.81,2790.5]
[null,null,null,"28002 Lurup",48.865257424458569,55.81,2790.5]
[null,null,null,"28003 Lurup",73.29788613668785,55.81,2790.5]
[null,null,null,"28004 Lurup",61.081571780573221,55.81,2790.5]
[null,null,null,"28005 Lurup",85.514200492802502,55.81,2790.5]
[null,null,null,"28006 Lurup",97.730514848917139,55.81,2790.5]
[null,null,null,"28007 Lurup",73.29788613668785,55.81,2790.5]
[null,null,null,"28008 Lurup",97.730514848917139,55.81,2790.5]
[null,null,null,"28009 Lurup",73.29788613668785,55.81,2790.5]
[null,null,null,"28010 Lurup",73.29788613668785,55.81,2790.5]
[null,null,null,"28011 Lurup",73.29788613668785,55.81,2790.5]
[null,null,null,"28012 Lurup",73.29788613668785,55.81,2790.5]
[null,null,null,"28013 Lurup",85.514200492802502,55.81,2790.5]
[null,null,null,"28014 Lurup",73.29788613668785,55.81,2790.5]
[null,null,null,"28015 Lurup",73.29788613668785,55.81,2790.5]
[null,null,null,"28016 Lurup",73.29788613668785,55.81,2790.5]
[null,null,null,"29001 Osdorf",48.865257424458569,36.520000000000003,1826.0000000000002]
[null,null,null,"29002 Osdorf",97.730514848917139,36.520000000000003,{"$f":"SUM(F260*50)","v":1826.0000000000002}]
[null,null,null,"29003 Osdorf",97.730514848917139,36.520000000000003,1826.0000000000002]
[null,null,null,"29004 Osdorf",85.514200492802502,36.520000000000003,1826.0000000000002]
[null,null,null,"29005 Osdorf",73.29788613668785,36.520000000000003,1826.0000000000002]
[null,null,null,"29006 Osdorf",97.730514848917139,36.520000000000003,1826.0000000000002]
[null,null,null,"29007 Osdorf",73.29788613668785,36.520000000000003,1826.0000000000002]
[null,null,null,"29008 Osdorf",73.29788613668785,36.520000000000003,1826.0000000000002]
[null,null,null,"29009 Osdorf",85.514200492802502,36.520000000000003,1826.0000000000002]
[null,null,null,"29010 Osdorf",73.29788613668785,36.520000000000003,1826.0000000000002]
[null,null,null,"29011 Osdorf",73.29788613668785,36.520000000000003,1826.0000000000002]
[null,null,null,"29012 Osdorf",48.865257424458569,36.520000000000003,1826.0000000000002]
[null,null,null,"29013 Osdorf",48.865257424458569,36.520000000000003,1826.0000000000002]
[null,null,null,"30001 Nienstedten",48.865257424458569,16.46,823]
[null,null,null,"30002 Nienstedten",73.29788613668785,16.46,823]
[null,null,null,"30003 Nienstedten",73.29788613668785,16.46,823]
[null,null,null,"30004 Nienstedten",48.865257424458569,16.46,823]
[null,null,null,"31001 Blankenese",24.432628712229285,16.149999999999999,807.49999999999989]
[null,null,null,"31002 Blankenese",36.648943068343925,16.149999999999999,807.49999999999989]
[null,null,null,"31003 Blankenese",97.730514848917139,16.149999999999999,807.49999999999989]
[null,null,null,"31004 Blankenese",61.081571780573221,16.149999999999999,807.49999999999989]
[null,null,null,"31005 Blankenese",97.730514848917139,16.149999999999999,807.49999999999989]
[null,null,null,"31006 Blankenese",73.29788613668785,16.149999999999999,807.49999999999989]
[null,null,null,"32001 Iserbrook",109.94682920503178,42.32,2116]
[null,null,null,"32002 Iserbrook",61.081571780573221,42.32,2116]
[null,null,null,"32003 Iserbrook",48.865257424458569,42.32,2116]
[null,null,null,"32004 Iserbrook",73.29788613668785,42.32,2116]
[null,null,null,"32005 Iserbrook",48.865257424458569,42.32,2116]
[null,null,null,"33001 Suelldorf",24.432628712229285,16.14,807]
[null,null,null,"33002 Suelldorf",109.94682920503178,16.14,807]
[null,null,null,"33003 Suelldorf",48.865257424458569,16.14,807]
[null,null,null,"33004 Suelldorf",109.94682920503178,16.14,807]
[null,null,null,"33005 Suelldorf",122.16314356114644,16.14,807]
[null,null,null,"34001 Rissen",24.432628712229285,9.1,455]
[null,null,null,"34002 Rissen",61.081571780573221,9.1,455]
[null,null,null,"34003 Rissen",24.432628712229285,9.1,455]
[null,null,null,"34004 Rissen",48.865257424458569,9.1,455]
[null,null,null,"34005 Rissen",109.94682920503178,9.1,455]
[null,null,null,"34006 Rissen",85.514200492802502,9.1,455]
[null,null,null,"34007 Rissen",36.648943068343925,9.1,455]
[null,null,null,"34008 Rissen",24.432628712229285,9.1,455]
[null,null,null,"35001 Eimsbuettel",183.24471534171965,177.56,8878]
[null,null,null,"35002 Eimsbuettel",183.24471534171965,177.56,8878]
[null,null,null,"35003 Eimsbuettel",183.24471534171965,177.56,8878]
[null,null,null,"35004 Eimsbuettel",183.24471534171965,177.56,8878]
[null,null,null,"35005 Eimsbuettel",183.24471534171965,177.56,8878]
[null,null,null,"35006 Eimsbuettel",183.24471534171965,177.56,8878]
[null,null,null,"35007 Eimsbuettel",183.24471534171965,177.56,8878]
[null,null,null,"35008 Eimsbuettel",183.24471534171965,177.56,8878]
[null,null,null,"35009 Eimsbuettel",183.24471534171965,177.56,8878]
[null,null,null,"35010 Eimsbuettel",183.24471534171965,177.56,8878]
[null,null,null,"35011 Eimsbuettel",146.5957722733757,177.56,8878]
[null,null,null,"35012 Eimsbuettel",171.028400985605,177.56,8878]
[null,null,null,"35013 Eimsbuettel",183.24471534171965,177.56,8878]
[null,null,null,"35014 Eimsbuettel",183.24471534171965,177.56,8878]
[null,null,null,"35015 Eimsbuettel",183.24471534171965,177.56,8878]
[null,null,null,"35016 Eimsbuettel",146.5957722733757,177.56,8878]
[null,null,null,"35017 Eimsbuettel",183.24471534171965,177.56,8878]
[null,null,null,"35018 Eimsbuettel",183.24471534171965,177.56,8878]
[null,null,null,"35019 Eimsbuettel",171.028400985605,177.56,8878]
[null,null,null,"35020 Eimsbuettel",171.028400985605,177.56,8878]
[null,null,null,"35021 Eimsbuettel",183.24471534171965,177.56,8878]
[null,null,null,"35022 Eimsbuettel",183.24471534171965,177.56,8878]
[null,null,null,"35023 Eimsbuettel",183.24471534171965,177.56,8878]
[null,null,null,"35024 Eimsbuettel",183.24471534171965,177.56,8878]
[null,null,null,"35025 Eimsbuettel",183.24471534171965,177.56,{"$f":"SUM(F324*50)","v":8878}]
[null,null,null,"35026 Eimsbuettel",183.24471534171965,177.56,8878]
[null,null,null,"36001 Rotherbaum",158.81208662949035,60.93,3046.5]
[null,null,null,"36002 Rotherbaum",171.028400985605,60.93,3046.5]
[null,null,null,"36003 Rotherbaum",183.24471534171965,60.93,3046.5]
[null,null,null,"36004 Rotherbaum",183.24471534171965,60.93,3046.5]
[null,null,null,"36005 Rotherbaum",85.514200492802502,60.93,3046.5]
[null,null,null,"36006 Rotherbaum",158.81208662949035,60.93,3046.5]
[null,null,null,"36007 Rotherbaum",134.37945791726108,60.93,3046.5]
[null,null,null,"36008 Rotherbaum",146.5957722733757,60.93,3046.5]
[null,null,null,"36009 Rotherbaum",171.028400985605,60.93,3046.5]
[null,null,null,"36010 Rotherbaum",158.81208662949035,60.93,3046.5]
[null,null,null,"36011 Rotherbaum",109.94682920503178,60.93,3046.5]
[null,null,null,"37001 Harvestehude",183.24471534171965,86.57,4328.5]
[null,null,null,"37002 Harvestehude",183.24471534171965,86.57,4328.5]
[null,null,null,"37003 Harvestehude",171.028400985605,86.57,4328.5]
[null,null,null,"37004 Harvestehude",134.37945791726108,86.57,4328.5]
[null,null,null,"37005 Harvestehude",183.24471534171965,86.57,4328.5]
[null,null,null,"37006 Harvestehude",183.24471534171965,86.57,4328.5]
[null,null,null,"37007 Harvestehude",183.24471534171965,86.57,4328.5]
[null,null,null,"37008 Harvestehude",158.81208662949035,86.57,4328.5]
[null,null,null,"37009 Harvestehude",85.514200492802502,86.57,4328.5]
[null,null,null,"38001 Hoheluft-West",146.5957722733757,189.88,9494]
[null,null,null,"38002 Hoheluft-West",146.5957722733757,189.88,9494]
[null,null,null,"38003 Hoheluft-West",146.5957722733757,189.88,9494]
[null,null,null,"38004 Hoheluft-West",171.028400985605,189.88,9494]
[null,null,null,"38005 Hoheluft-West",183.24471534171965,189.88,9494]
[null,null,null,"38006 Hoheluft-West",183.24471534171965,189.88,9494]
[null,null,null,"39001 Lokstedt",85.514200492802502,58.16,2908]
[null,null,null,"39002 Lokstedt",122.16314356114644,58.16,2908]
[null,null,null,"39003 Lokstedt",122.16314356114644,58.16,2908]
[null,null,null,"39004 Lokstedt",109.94682920503178,58.16,2908]
[null,null,null,"39005 Lokstedt",122.16314356114644,58.16,2908]
[null,null,null,"39006 Lokstedt",146.5957722733757,58.16,2908]
[null,null,null,"39007 Lokstedt",134.37945791726108,58.16,2908]
[null,null,null,"39008 Lokstedt",122.16314356114644,58.16,2908]
[null,null,null,"39009 Lokstedt",122.16314356114644,58.16,2908]
[null,null,null,"39010 Lokstedt",183.24471534171965,58.16,2908]
[null,null,null,"39011 Lokstedt",122.16314356114644,58.16,2908]
[null,null,null,"39012 Lokstedt",134.37945791726108,58.16,2908]
[null,null,null,"40001 Niendorf",24.432628712229285,32.380000000000003,1619.0000000000002]
[null,null,null,"40002 Niendorf",97.730514848917139,32.380000000000003,1619.0000000000002]
[null,null,null,"40003 Niendorf",61.081571780573221,32.380000000000003,1619.0000000000002]
[null,null,null,"40004 Niendorf",24.432628712229285,32.380000000000003,1619.0000000000002]
[null,null,null,"40005 Niendorf",122.16314356114644,32.380000000000003,1619.0000000000002]
[null,null,null,"40006 Niendorf",122.16314356114644,32.380000000000003,1619.0000000000002]
[null,null,null,"40007 Niendorf",97.730514848917139,32.380000000000003,1619.0000000000002]
[null,null,null,"40008 Niendorf",24.432628712229285,32.380000000000003,1619.0000000000002]
[null,null,null,"40009 Niendorf",48.865257424458569,32.380000000000003,1619.0000000000002]
[null,null,null,"40010 Niendorf",73.29788613668785,32.380000000000003,1619.0000000000002]
[null,null,null,"40011 Niendorf",122.16314356114644,32.380000000000003,1619.0000000000002]
[null,null,null,"40012 Niendorf",109.94682920503178,32.380000000000003,1619.0000000000002]
[null,null,null,"40013 Niendorf",109.94682920503178,32.380000000000003,1619.0000000000002]
[null,null,null,"40014 Niendorf",122.16314356114644,32.380000000000003,1619.0000000000002]
[null,null,null,"40015 Niendorf",36.648943068343925,32.380000000000003,1619.0000000000002]
[null,null,null,"40016 Niendorf",134.37945791726108,32.380000000000003,1619.0000000000002]
[null,null,null,"40017 Niendorf",73.29788613668785,32.380000000000003,1619.0000000000002]
[null,null,null,"40018 Niendorf",36.648943068343925,32.380000000000003,1619.0000000000002]
[null,null,null,"40019 Niendorf",85.514200492802502,32.380000000000003,1619.0000000000002]
[null,null,null,"40020 Niendorf",109.94682920503178,32.380000000000003,1619.0000000000002]
[null,null,null,"41001 Schnelsen",48.865257424458569,31.88,1594]
[null,null,null,"41002 Schnelsen",24.432628712229285,31.88,1594]
[null,null,null,"41003 Schnelsen",97.730514848917139,31.88,1594]
[null,null,null,"41004 Schnelsen",48.865257424458569,31.88,1594]
[null,null,null,"41005 Schnelsen",61.081571780573221,31.88,{"$f":"SUM(F388*50)","v":1594}]
[null,null,null,"41006 Schnelsen",85.514200492802502,31.88,1594]
[null,null,null,"41007 Schnelsen",109.94682920503178,31.88,1594]
[null,null,null,"41008 Schnelsen",73.29788613668785,31.88,1594]
[null,null,null,"41009 Schnelsen",85.514200492802502,31.88,1594]
[null,null,null,"41010 Schnelsen",24.432628712229285,31.88,1594]
[null,null,null,"41011 Schnelsen",48.865257424458569,31.88,1594]
[null,null,null,"41012 Schnelsen",48.865257424458569,31.88,1594]
[null,null,null,"42001 Eidelstedt",73.29788613668785,37.19,1859.5]
[null,null,null,"42002 Eidelstedt",73.29788613668785,37.19,1859.5]
[null,null,null,"42003 Eidelstedt",109.94682920503178,37.19,1859.5]
[null,null,null,"42004 Eidelstedt",97.730514848917139,37.19,1859.5]
[null,null,null,"42005 Eidelstedt",97.730514848917139,37.19,1859.5]
[null,null,null,"42006 Eidelstedt",61.081571780573221,37.19,1859.5]
[null,null,null,"42007 Eidelstedt",24.432628712229285,37.19,1859.5]
[null,null,null,"42008 Eidelstedt",61.081571780573221,37.19,1859.5]
[null,null,null,"42009 Eidelstedt",85.514200492802502,37.19,1859.5]
[null,null,null,"42010 Eidelstedt",48.865257424458569,37.19,1859.5]
[null,null,null,"42011 Eidelstedt",73.29788613668785,37.19,1859.5]
[null,null,null,"42012 Eidelstedt",97.730514848917139,37.19,1859.5]
[null,null,null,"42013 Eidelstedt",109.94682920503178,37.19,1859.5]
[null,null,null,"42014 Eidelstedt",48.865257424458569,37.19,1859.5]
[null,null,null,"42015 Eidelstedt",97.730514848917139,37.19,1859.5]
[null,null,null,"42016 Eidelstedt",97.730514848917139,37.19,1859.5]
[null,null,null,"42017 Eidelstedt",85.514200492802502,37.19,1859.5]
[null,null,null,"42018 Eidelstedt",61.081571780573221,37.19,1859.5]
[null,null,null,"43001 Stellingen",24.432628712229285,42.76,2138]
[null,null,null,"43002 Stellingen",61.081571780573221,42.76,2138]
[null,null,null,"43003 Stellingen",85.514200492802502,42.76,2138]
[null,null,null,"43004 Stellingen",85.514200492802502,42.76,2138]
[null,null,null,"43005 Stellingen",85.514200492802502,42.76,2138]
[null,null,null,"43006 Stellingen",122.16314356114644,42.76,2138]
[null,null,null,"43007 Stellingen",134.37945791726108,42.76,2138]
[null,null,null,"43008 Stellingen",122.16314356114644,42.76,2138]
[null,null,null,"43009 Stellingen",73.29788613668785,42.76,2138]
[null,null,null,"43010 Stellingen",158.81208662949035,42.76,2138]
[null,null,null,"43011 Stellingen",146.5957722733757,42.76,2138]
[null,null,null,"43012 Stellingen",122.16314356114644,42.76,2138]
[null,null,null,"43013 Stellingen",134.37945791726108,42.76,2138]
[null,null,null,"43014 Stellingen",146.5957722733757,42.76,2138]
[null,null,null,"43015 Stellingen",146.5957722733757,42.76,2138]
[null,null,null,"43016 Stellingen",183.24471534171965,42.76,2138]
[null,null,null,"44001 Hoheluft-Ost",146.5957722733757,163.75,8187.5]
[null,null,null,"44002 Hoheluft-Ost",146.5957722733757,163.75,8187.5]
[null,null,null,"44003 Hoheluft-Ost",158.81208662949035,163.75,8187.5]
[null,null,null,"44004 Hoheluft-Ost",183.24471534171965,163.75,8187.5]
[null,null,null,"44005 Hoheluft-Ost",183.24471534171965,163.75,8187.5]
[null,null,null,"45001 Eppendorf",122.16314356114644,89.68,4484]
[null,null,null,"45002 Eppendorf",171.028400985605,89.68,4484]
[null,null,null,"45003 Eppendorf",146.5957722733757,89.68,4484]
[null,null,null,"45004 Eppendorf",146.5957722733757,89.68,4484]
[null,null,null,"45005 Eppendorf",171.028400985605,89.68,4484]
[null,null,null,"45006 Eppendorf",85.514200492802502,89.68,4484]
[null,null,null,"45007 Eppendorf",183.24471534171965,89.68,4484]
[null,null,null,"45008 Eppendorf",183.24471534171965,89.68,4484]
[null,null,null,"45009 Eppendorf",183.24471534171965,89.68,4484]
[null,null,null,"45010 Eppendorf",183.24471534171965,89.68,4484]
[null,null,null,"45011 Eppendorf",146.5957722733757,89.68,4484]
[null,null,null,"46001 GroßBorstel",36.648943068343925,19.34,967]
[null,null,null,"46002 GroßBorstel",61.081571780573221,19.34,967]
[null,null,null,"46003 GroßBorstel",48.865257424458569,19.34,967]
[null,null,null,"46004 GroßBorstel",122.16314356114644,19.34,967]
[null,null,null,"46005 GroßBorstel",97.730514848917139,19.34,967]
[null,null,null,"46006 GroßBorstel",61.081571780573221,19.34,967]
[null,null,null,"46007 GroßBorstel",109.94682920503178,19.34,{"$f":"SUM(F452*50)","v":967}]
[null,null,null,"47001 Alsterdorf",73.29788613668785,46.14,2307]
[null,null,null,"47002 Alsterdorf",73.29788613668785,46.14,2307]
[null,null,null,"47003 Alsterdorf",122.16314356114644,46.14,2307]
[null,null,null,"47004 Alsterdorf",122.16314356114644,46.14,2307]
[null,null,null,"47005 Alsterdorf",158.81208662949035,46.14,2307]
[null,null,null,"47006 Alsterdorf",134.37945791726108,46.14,2307]
[null,null,null,"47007 Alsterdorf",146.5957722733757,46.14,2307]
[null,null,null,"47008 Alsterdorf",158.81208662949035,46.14,2307]
[null,null,null,"48001 Winterhude",171.028400985605,71.45,3572.5]
[null,null,null,"48002 Winterhude",183.24471534171965,71.45,3572.5]
[null,null,null,"48003 Winterhude",134.37945791726108,71.45,3572.5]
[null,null,null,"48004 Winterhude",146.5957722733757,71.45,3572.5]
[null,null,null,"48005 Winterhude",109.94682920503178,71.45,3572.5]
[null,null,null,"48006 Winterhude",183.24471534171965,71.45,3572.5]
[null,null,null,"48007 Winterhude",146.5957722733757,71.45,3572.5]
[null,null,null,"48008 Winterhude",122.16314356114644,71.45,3572.5]
[null,null,null,"48009 Winterhude",183.24471534171965,71.45,3572.5]
[null,null,null,"48010 Winterhude",109.94682920503178,71.45,3572.5]
[null,null,null,"48011 Winterhude",183.24471534171965,71.45,3572.5]
[null,null,null,"48012 Winterhude",122.16314356114644,71.45,3572.5]
[null,null,null,"48013 Winterhude",171.028400985605,71.45,3572.5]
[null,null,null,"48014 Winterhude",183.24471534171965,71.45,3572.5]
[null,null,null,"48015 Winterhude",183.24471534171965,71.45,3572.5]
[null,null,null,"48016 Winterhude",183.24471534171965,71.45,3572.5]
[null,null,null,"48017 Winterhude",171.028400985605,71.45,3572.5]
[null,null,null,"48018 Winterhude",109.94682920503178,71.45,3572.5]
[null,null,null,"48019 Winterhude",134.37945791726108,71.45,3572.5]
[null,null,null,"48020 Winterhude",134.37945791726108,71.45,3572.5]
[null,null,null,"48021 Winterhude",134.37945791726108,71.45,3572.5]
[null,null,null,"48022 Winterhude",146.5957722733757,71.45,3572.5]
[null,null,null,"48023 Winterhude",134.37945791726108,71.45,3572.5]
[null,null,null,"48024 Winterhude",134.37945791726108,71.45,3572.5]
[null,null,null,"48025 Winterhude",183.24471534171965,71.45,3572.5]
[null,null,null,"48026 Winterhude",73.29788613668785,71.45,3572.5]
[null,null,null,"49001 Uhlenhorst",134.37945791726108,78.599999999999994,3929.9999999999995]
[null,null,null,"49002 Uhlenhorst",85.514200492802502,78.599999999999994,3929.9999999999995]
[null,null,null,"49003 Uhlenhorst",109.94682920503178,78.599999999999994,3929.9999999999995]
[null,null,null,"49004 Uhlenhorst",146.5957722733757,78.599999999999994,3929.9999999999995]
[null,null,null,"49005 Uhlenhorst",146.5957722733757,78.599999999999994,3929.9999999999995]
[null,null,null,"49006 Uhlenhorst",171.028400985605,78.599999999999994,3929.9999999999995]
[null,null,null,"49007 Uhlenhorst",183.24471534171965,78.599999999999994,3929.9999999999995]
[null,null,null,"49008 Uhlenhorst",183.24471534171965,78.599999999999994,3929.9999999999995]
[null,null,null,"49009 Uhlenhorst",171.028400985605,78.599999999999994,3929.9999999999995]
[null,null,null,"50001 Hohenfelde",97.730514848917139,82.62,4131]
[null,null,null,"50002 Hohenfelde",183.24471534171965,82.62,4131]
[null,null,null,"50003 Hohenfelde",158.81208662949035,82.62,4131]
[null,null,null,"50004 Hohenfelde",171.028400985605,82.62,4131]
[null,null,null,"50005 Hohenfelde",183.24471534171965,82.62,4131]
[null,null,null,"51001 Barmbek-Sued",122.16314356114644,110.07,5503.5]
[null,null,null,"51002 Barmbek-Sued",183.24471534171965,110.07,5503.5]
[null,null,null,"51003 Barmbek-Sued",171.028400985605,110.07,5503.5]
[null,null,null,"51004 Barmbek-Sued",183.24471534171965,110.07,5503.5]
[null,null,null,"51005 Barmbek-Sued",171.028400985605,110.07,5503.5]
[null,null,null,"51006 Barmbek-Sued",146.5957722733757,110.07,5503.5]
[null,null,null,"51007 Barmbek-Sued",183.24471534171965,110.07,5503.5]
[null,null,null,"51008 Barmbek-Sued",171.028400985605,110.07,5503.5]
[null,null,null,"51009 Barmbek-Sued",171.028400985605,110.07,5503.5]
[null,null,null,"51010 Barmbek-Sued",183.24471534171965,110.07,5503.5]
[null,null,null,"51011 Barmbek-Sued",122.16314356114644,110.07,5503.5]
[null,null,null,"51012 Barmbek-Sued",171.028400985605,110.07,5503.5]
[null,null,null,"51013 Barmbek-Sued",146.5957722733757,110.07,5503.5]
[null,null,null,"51014 Barmbek-Sued",146.5957722733757,110.07,5503.5]
[null,null,null,"51015 Barmbek-Sued",171.028400985605,110.07,5503.5]
[null,null,null,"51016 Barmbek-Sued",171.028400985605,110.07,{"$f":"SUM(F516*50)","v":5503.5}]
[null,null,null,"52001 Dulsberg",171.028400985605,145.16,7258]
[null,null,null,"52002 Dulsberg",171.028400985605,145.16,7258]
[null,null,null,"52003 Dulsberg",171.028400985605,145.16,7258]
[null,null,null,"52004 Dulsberg",171.028400985605,145.16,7258]
[null,null,null,"52005 Dulsberg",183.24471534171965,145.16,7258]
[null,null,null,"52006 Dulsberg",183.24471534171965,145.16,7258]
[null,null,null,"52007 Dulsberg",183.24471534171965,145.16,7258]
[null,null,null,"53001 Barmbek-Nord",134.37945791726108,104.4,5220]
[null,null,null,"53002 Barmbek-Nord",158.81208662949035,104.4,5220]
[null,null,null,"53003 Barmbek-Nord",146.5957722733757,104.4,5220]
[null,null,null,"53004 Barmbek-Nord",134.37945791726108,104.4,5220]
[null,null,null,"53005 Barmbek-Nord",158.81208662949035,104.4,5220]
[null,null,null,"53006 Barmbek-Nord",146.5957722733757,104.4,5220]
[null,null,null,"53007 Barmbek-Nord",183.24471534171965,104.4,5220]
[null,null,null,"53008 Barmbek-Nord",183.24471534171965,104.4,5220]
[null,null,null,"53009 Barmbek-Nord",183.24471534171965,104.4,5220]
[null,null,null,"53010 Barmbek-Nord",158.81208662949035,104.4,5220]
[null,null,null,"53011 Barmbek-Nord",171.028400985605,104.4,5220]
[null,null,null,"53012 Barmbek-Nord",122.16314356114644,104.4,5220]
[null,null,null,"53013 Barmbek-Nord",183.24471534171965,104.4,5220]
[null,null,null,"53014 Barmbek-Nord",183.24471534171965,104.4,5220]
[null,null,null,"53015 Barmbek-Nord",171.028400985605,104.4,5220]
[null,null,null,"53016 Barmbek-Nord",122.16314356114644,104.4,5220]
[null,null,null,"53017 Barmbek-Nord",183.24471534171965,104.4,5220]
[null,null,null,"53018 Barmbek-Nord",183.24471534171965,104.4,5220]
[null,null,null,"53019 Barmbek-Nord",171.028400985605,104.4,5220]
[null,null,null,"53020 Barmbek-Nord",171.028400985605,104.4,5220]
[null,null,null,"53021 Barmbek-Nord",146.5957722733757,104.4,5220]
[null,null,null,"53022 Barmbek-Nord",183.24471534171965,104.4,5220]
[null,null,null,"53023 Barmbek-Nord",183.24471534171965,104.4,5220]
[null,null,null,"53024 Barmbek-Nord",158.81208662949035,104.4,5220]
[null,null,null,"54001 Ohlsdorf",73.29788613668785,21.59,1079.5]
[null,null,null,"54002 Ohlsdorf",24.432628712229285,21.59,1079.5]
[null,null,null,"54003 Ohlsdorf",73.29788613668785,21.59,1079.5]
[null,null,null,"54004 Ohlsdorf",171.028400985605,21.59,1079.5]
[null,null,null,"54005 Ohlsdorf",134.37945791726108,21.59,1079.5]
[null,null,null,"54006 Ohlsdorf",122.16314356114644,21.59,1079.5]
[null,null,null,"54007 Ohlsdorf",146.5957722733757,21.59,1079.5]
[null,null,null,"54008 Ohlsdorf",109.94682920503178,21.59,1079.5]
[null,null,null,"55001 Fuhlsbuettel",36.648943068343925,19.100000000000001,955.00000000000011]
[null,null,null,"55002 Fuhlsbuettel",109.94682920503178,19.100000000000001,955.00000000000011]
[null,null,null,"55003 Fuhlsbuettel",109.94682920503178,19.100000000000001,955.00000000000011]
[null,null,null,"55004 Fuhlsbuettel",109.94682920503178,19.100000000000001,955.00000000000011]
[null,null,null,"55005 Fuhlsbuettel",97.730514848917139,19.100000000000001,955.00000000000011]
[null,null,null,"55006 Fuhlsbuettel",109.94682920503178,19.100000000000001,955.00000000000011]
[null,null,null,"55007 Fuhlsbuettel",122.16314356114644,19.100000000000001,955.00000000000011]
[null,null,null,"55008 Fuhlsbuettel",109.94682920503178,19.100000000000001,955.00000000000011]
[null,null,null,"56001 Langenhorn",97.730514848917139,32.57,1628.5]
[null,null,null,"56002 Langenhorn",73.29788613668785,32.57,1628.5]
[null,null,null,"56003 Langenhorn",122.16314356114644,32.57,1628.5]
[null,null,null,"56004 Langenhorn",73.29788613668785,32.57,1628.5]
[null,null,null,"56005 Langenhorn",61.081571780573221,32.57,1628.5]
[null,null,null,"56006 Langenhorn",73.29788613668785,32.57,1628.5]
[null,null,null,"56007 Langenhorn",48.865257424458569,32.57,1628.5]
[null,null,null,"56008 Langenhorn",97.730514848917139,32.57,1628.5]
[null,null,null,"56009 Langenhorn",73.29788613668785,32.57,1628.5]
[null,null,null,"56010 Langenhorn",73.29788613668785,32.57,1628.5]
[null,null,null,"56011 Langenhorn",36.648943068343925,32.57,1628.5]
[null,null,null,"56012 Langenhorn",36.648943068343925,32.57,1628.5]
[null,null,null,"56013 Langenhorn",61.081571780573221,32.57,1628.5]
[null,null,null,"56014 Langenhorn",61.081571780573221,32.57,1628.5]
[null,null,null,"56015 Langenhorn",61.081571780573221,32.57,1628.5]
[null,null,null,"56016 Langenhorn",109.94682920503178,32.57,1628.5]
[null,null,null,"56017 Langenhorn",61.081571780573221,32.57,{"$f":"SUM(F580*50)","v":1628.5}]
[null,null,null,"56018 Langenhorn",24.432628712229285,32.57,1628.5]
[null,null,null,"56019 Langenhorn",48.865257424458569,32.57,1628.5]
[null,null,null,"56020 Langenhorn",109.94682920503178,32.57,1628.5]
[null,null,null,"56021 Langenhorn",85.514200492802502,32.57,1628.5]
[null,null,null,"57001 Eilbek",183.24471534171965,123.33,6166.5]
[null,null,null,"57002 Eilbek",183.24471534171965,123.33,6166.5]
[null,null,null,"57003 Eilbek",183.24471534171965,123.33,6166.5]
[null,null,null,"57004 Eilbek",171.028400985605,123.33,6166.5]
[null,null,null,"57005 Eilbek",171.028400985605,123.33,6166.5]
[null,null,null,"57006 Eilbek",158.81208662949035,123.33,6166.5]
[null,null,null,"58001 Wandsbek",122.16314356114644,56.58,2829]
[null,null,null,"58002 Wandsbek",158.81208662949035,56.58,2829]
[null,null,null,"58003 Wandsbek",73.29788613668785,56.58,2829]
[null,null,null,"58004 Wandsbek",134.37945791726108,56.58,2829]
[null,null,null,"58005 Wandsbek",146.5957722733757,56.58,2829]
[null,null,null,"58006 Wandsbek",146.5957722733757,56.58,2829]
[null,null,null,"58007 Wandsbek",134.37945791726108,56.58,2829]
[null,null,null,"58008 Wandsbek",109.94682920503178,56.58,2829]
[null,null,null,"58009 Wandsbek",171.028400985605,56.58,2829]
[null,null,null,"58010 Wandsbek",158.81208662949035,56.58,2829]
[null,null,null,"58011 Wandsbek",122.16314356114644,56.58,2829]
[null,null,null,"58012 Wandsbek",134.37945791726108,56.58,2829]
[null,null,null,"58013 Wandsbek",122.16314356114644,56.58,2829]
[null,null,null,"58014 Wandsbek",122.16314356114644,56.58,2829]
[null,null,null,"59001 Marienthal",146.5957722733757,40.22,2011]
[null,null,null,"59002 Marienthal",122.16314356114644,40.22,2011]
[null,null,null,"59003 Marienthal",85.514200492802502,40.22,2011]
[null,null,null,"59004 Marienthal",109.94682920503178,40.22,2011]
[null,null,null,"59005 Marienthal",85.514200492802502,40.22,2011]
[null,null,null,"60001 Jenfeld",85.514200492802502,49.92,2496]
[null,null,null,"60002 Jenfeld",73.29788613668785,49.92,2496]
[null,null,null,"60003 Jenfeld",73.29788613668785,49.92,2496]
[null,null,null,"60004 Jenfeld",61.081571780573221,49.92,2496]
[null,null,null,"60005 Jenfeld",73.29788613668785,49.92,2496]
[null,null,null,"60006 Jenfeld",85.514200492802502,49.92,2496]
[null,null,null,"60007 Jenfeld",85.514200492802502,49.92,2496]
[null,null,null,"60008 Jenfeld",73.29788613668785,49.92,2496]
[null,null,null,"60009 Jenfeld",48.865257424458569,49.92,2496]
[null,null,null,"60010 Jenfeld",73.29788613668785,49.92,2496]
[null,null,null,"60011 Jenfeld",73.29788613668785,49.92,2496]
[null,null,null,"60012 Jenfeld",36.648943068343925,49.92,2496]
[null,null,null,"61001 Tonndorf",61.081571780573221,35.69,1784.5]
[null,null,null,"61002 Tonndorf",97.730514848917139,35.69,1784.5]
[null,null,null,"61003 Tonndorf",109.94682920503178,35.69,1784.5]
[null,null,null,"61004 Tonndorf",73.29788613668785,35.69,1784.5]
[null,null,null,"61005 Tonndorf",97.730514848917139,35.69,1784.5]
[null,null,null,"61006 Tonndorf",85.514200492802502,35.69,1784.5]
[null,null,null,"61007 Tonndorf",109.94682920503178,35.69,1784.5]
[null,null,null,"61008 Tonndorf",85.514200492802502,35.69,1784.5]
[null,null,null,"61009 Tonndorf",85.514200492802502,35.69,1784.5]
[null,null,null,"62001 Farmsen-Berne",36.648943068343925,42.26,2113]
[null,null,null,"62002 Farmsen-Berne",61.081571780573221,42.26,2113]
[null,null,null,"62003 Farmsen-Berne",73.29788613668785,42.26,2113]
[null,null,null,"62004 Farmsen-Berne",73.29788613668785,42.26,2113]
[null,null,null,"62005 Farmsen-Berne",61.081571780573221,42.26,2113]
[null,null,null,"62006 Farmsen-Berne",61.081571780573221,42.26,2113]
[null,null,null,"62007 Farmsen-Berne",61.081571780573221,42.26,2113]
[null,null,null,"62008 Farmsen-Berne",73.29788613668785,42.26,2113]
[null,null,null,"62009 Farmsen-Berne",61.081571780573221,42.26,2113]
[null,null,null,"62010 Farmsen-Berne",97.730514848917139,42.26,2113]
[null,null,null,"62011 Farmsen-Berne",109.94682920503178,42.26,2113]
[null,null,null,"62012 Farmsen-Berne",73.29788613668785,42.26,2113]
[null,null,null,"62013 Farmsen-Berne",85.514200492802502,42.26,2113]
[null,null,null,"62014 Farmsen-Berne",48.865257424458569,42.26,{"$f":"SUM(F644*50)","v":2113}]
[null,null,null,"62015 Farmsen-Berne",109.94682920503178,42.26,2113]
[null,null,null,"62016 Farmsen-Berne",48.865257424458569,42.26,2113]
[null,null,null,"63001 Bramfeld",24.432628712229285,50.65,2532.5]
[null,null,null,"63002 Bramfeld",61.081571780573221,50.65,2532.5]
[null,null,null,"63003 Bramfeld",61.081571780573221,50.65,2532.5]
[null,null,null,"63004 Bramfeld",48.865257424458569,50.65,2532.5]
[null,null,null,"63005 Bramfeld",73.29788613668785,50.65,2532.5]
[null,null,null,"63006 Bramfeld",73.29788613668785,50.65,2532.5]
[null,null,null,"63007 Bramfeld",48.865257424458569,50.65,2532.5]
[null,null,null,"63008 Bramfeld",61.081571780573221,50.65,2532.5]
[null,null,null,"63009 Bramfeld",109.94682920503178,50.65,2532.5]
[null,null,null,"63010 Bramfeld",85.514200492802502,50.65,2532.5]
[null,null,null,"63011 Bramfeld",61.081571780573221,50.65,2532.5]
[null,null,null,"63012 Bramfeld",109.94682920503178,50.65,2532.5]
[null,null,null,"63013 Bramfeld",36.648943068343925,50.65,2532.5]
[null,null,null,"63014 Bramfeld",109.94682920503178,50.65,2532.5]
[null,null,null,"63015 Bramfeld",122.16314356114644,50.65,2532.5]
[null,null,null,"63016 Bramfeld",97.730514848917139,50.65,2532.5]
[null,null,null,"63017 Bramfeld",97.730514848917139,50.65,2532.5]
[null,null,null,"63018 Bramfeld",61.081571780573221,50.65,2532.5]
[null,null,null,"63019 Bramfeld",73.29788613668785,50.65,2532.5]
[null,null,null,"63020 Bramfeld",109.94682920503178,50.65,2532.5]
[null,null,null,"63021 Bramfeld",122.16314356114644,50.65,2532.5]
[null,null,null,"63022 Bramfeld",122.16314356114644,50.65,2532.5]
[null,null,null,"63023 Bramfeld",109.94682920503178,50.65,2532.5]
[null,null,null,"63024 Bramfeld",146.5957722733757,50.65,2532.5]
[null,null,null,"64001 Steilshoop",73.29788613668785,78.67,3933.5]
[null,null,null,"64002 Steilshoop",134.37945791726108,78.67,3933.5]
[null,null,null,"64003 Steilshoop",146.5957722733757,78.67,3933.5]
[null,null,null,"64004 Steilshoop",122.16314356114644,78.67,3933.5]
[null,null,null,"64005 Steilshoop",134.37945791726108,78.67,3933.5]
[null,null,null,"64006 Steilshoop",146.5957722733757,78.67,3933.5]
[null,null,null,"64007 Steilshoop",122.16314356114644,78.67,3933.5]
[null,null,null,"64008 Steilshoop",109.94682920503178,78.67,3933.5]
[null,null,null,"64009 Steilshoop",109.94682920503178,78.67,3933.5]
[null,null,null,"64010 Steilshoop",109.94682920503178,78.67,3933.5]
[null,null,null,"65001 Wellingsbuettel",85.514200492802502,25.84,1292]
[null,null,null,"65002 Wellingsbuettel",85.514200492802502,25.84,1292]
[null,null,null,"65003 Wellingsbuettel",73.29788613668785,25.84,1292]
[null,null,null,"65004 Wellingsbuettel",85.514200492802502,25.84,1292]
[null,null,null,"65005 Wellingsbuettel",61.081571780573221,25.84,1292]
[null,null,null,"65006 Wellingsbuettel",36.648943068343925,25.84,1292]
[null,null,null,"66001 Sasel",48.865257424458569,28.05,1402.5]
[null,null,null,"66002 Sasel",48.865257424458569,28.05,1402.5]
[null,null,null,"66003 Sasel",73.29788613668785,28.05,1402.5]
[null,null,null,"66004 Sasel",48.865257424458569,28.05,1402.5]
[null,null,null,"66005 Sasel",36.648943068343925,28.05,1402.5]
[null,null,null,"66006 Sasel",61.081571780573221,28.05,1402.5]
[null,null,null,"66007 Sasel",48.865257424458569,28.05,1402.5]
[null,null,null,"66008 Sasel",24.432628712229285,28.05,1402.5]
[null,null,null,"66009 Sasel",24.432628712229285,28.05,1402.5]
[null,null,null,"66010 Sasel",24.432628712229285,28.05,1402.5]
[null,null,null,"66011 Sasel",24.432628712229285,28.05,1402.5]
[null,null,null,"67001 Poppenbuettel",24.432628712229285,27.92,1396]
[null,null,null,"67002 Poppenbuettel",24.432628712229285,27.92,1396]
[null,null,null,"67003 Poppenbuettel",24.432628712229285,27.92,1396]
[null,null,null,"67004 Poppenbuettel",48.865257424458569,27.92,1396]
[null,null,null,"67005 Poppenbuettel",48.865257424458569,27.92,1396]
[null,null,null,"67006 Poppenbuettel",61.081571780573221,27.92,1396]
[null,null,null,"67007 Poppenbuettel",61.081571780573221,27.92,1396]
[null,null,null,"67008 Poppenbuettel",61.081571780573221,27.92,1396]
[null,null,null,"67009 Poppenbuettel",73.29788613668785,27.92,1396]
[null,null,null,"67010 Poppenbuettel",48.865257424458569,27.92,1396]
[null,null,null,"67011 Poppenbuettel",36.648943068343925,27.92,{"$f":"SUM(F708*50)","v":1396}]
[null,null,null,"67012 Poppenbuettel",48.865257424458569,27.92,1396]
[null,null,null,"67013 Poppenbuettel",48.865257424458569,27.92,1396]
[null,null,null,"67014 Poppenbuettel",134.37945791726108,27.92,1396]
[null,null,null,"67015 Poppenbuettel",109.94682920503178,27.92,1396]
[null,null,null,"68001 Hummelsbuettel",24.432628712229285,19.03,951.5]
[null,null,null,"68002 Hummelsbuettel",85.514200492802502,19.03,951.5]
[null,null,null,"68003 Hummelsbuettel",73.29788613668785,19.03,951.5]
[null,null,null,"68004 Hummelsbuettel",61.081571780573221,19.03,951.5]
[null,null,null,"68005 Hummelsbuettel",73.29788613668785,19.03,951.5]
[null,null,null,"68006 Hummelsbuettel",61.081571780573221,19.03,951.5]
[null,null,null,"68007 Hummelsbuettel",97.730514848917139,19.03,951.5]
[null,null,null,"68008 Hummelsbuettel",73.29788613668785,19.03,951.5]
[null,null,null,"68009 Hummelsbuettel",36.648943068343925,19.03,951.5]
[null,null,null,"69001 Lemsahl-Mellingstedt",24.432628712229285,8.34,417]
[null,null,null,"69002 Lemsahl-Mellingstedt",24.432628712229285,8.34,417]
[null,null,null,"70001 Duvenstedt",36.648943068343925,9.16,458]
[null,null,null,"70002 Duvenstedt",61.081571780573221,9.16,458]
[null,null,null,"71001 Wohldorf-Ohlstedt",24.432628712229285,2.78,139]
[null,null,null,"71002 Wohldorf-Ohlstedt",48.865257424458569,2.78,139]
[null,null,null,"71003 Wohldorf-Ohlstedt",48.865257424458569,2.78,139]
[null,null,null,"72001 Bergstedt",36.648943068343925,14.47,723.5]
[null,null,null,"72002 Bergstedt",48.865257424458569,14.47,723.5]
[null,null,null,"72003 Bergstedt",48.865257424458569,14.47,723.5]
[null,null,null,"72004 Bergstedt",73.29788613668785,14.47,723.5]
[null,null,null,"72005 Bergstedt",24.432628712229285,14.47,723.5]
[null,null,null,"72006 Bergstedt",73.29788613668785,14.47,723.5]
[null,null,null,"73001 Volksdorf",85.514200492802502,17.739999999999998,886.99999999999989]
[null,null,null,"73002 Volksdorf",48.865257424458569,17.739999999999998,886.99999999999989]
[null,null,null,"73003 Volksdorf",48.865257424458569,17.739999999999998,886.99999999999989]
[null,null,null,"73004 Volksdorf",61.081571780573221,17.739999999999998,886.99999999999989]
[null,null,null,"73005 Volksdorf",61.081571780573221,17.739999999999998,886.99999999999989]
[null,null,null,"73006 Volksdorf",61.081571780573221,17.739999999999998,886.99999999999989]
[null,null,null,"73007 Volksdorf",97.730514848917139,17.739999999999998,886.99999999999989]
[null,null,null,"73008 Volksdorf",109.94682920503178,17.739999999999998,886.99999999999989]
[null,null,null,"73009 Volksdorf",48.865257424458569,17.739999999999998,886.99999999999989]
[null,null,null,"73010 Volksdorf",48.865257424458569,17.739999999999998,886.99999999999989]
[null,null,null,"73011 Volksdorf",48.865257424458569,17.739999999999998,886.99999999999989]
[null,null,null,"73012 Volksdorf",48.865257424458569,17.739999999999998,886.99999999999989]
[null,null,null,"74001 Rahlstedt",61.081571780573221,33.44,1672]
[null,null,null,"74002 Rahlstedt",48.865257424458569,33.44,1672]
[null,null,null,"74003 Rahlstedt",61.081571780573221,33.44,1672]
[null,null,null,"74004 Rahlstedt",24.432628712229285,33.44,1672]
[null,null,null,"74005 Rahlstedt",109.94682920503178,33.44,1672]
[null,null,null,"74006 Rahlstedt",85.514200492802502,33.44,1672]
[null,null,null,"74007 Rahlstedt",73.29788613668785,33.44,1672]
[null,null,null,"74008 Rahlstedt",85.514200492802502,33.44,1672]
[null,null,null,"74009 Rahlstedt",85.514200492802502,33.44,1672]
[null,null,null,"74010 Rahlstedt",97.730514848917139,33.44,1672]
[null,null,null,"74011 Rahlstedt",73.29788613668785,33.44,1672]
[null,null,null,"74012 Rahlstedt",73.29788613668785,33.44,1672]
[null,null,null,"74013 Rahlstedt",61.081571780573221,33.44,1672]
[null,null,null,"74014 Rahlstedt",85.514200492802502,33.44,1672]
[null,null,null,"74015 Rahlstedt",73.29788613668785,33.44,1672]
[null,null,null,"74016 Rahlstedt",85.514200492802502,33.44,1672]
[null,null,null,"74017 Rahlstedt",73.29788613668785,33.44,1672]
[null,null,null,"74018 Rahlstedt",97.730514848917139,33.44,1672]
[null,null,null,"74019 Rahlstedt",85.514200492802502,33.44,1672]
[null,null,null,"74020 Rahlstedt",48.865257424458569,33.44,1672]
[null,null,null,"74021 Rahlstedt",85.514200492802502,33.44,1672]
[null,null,null,"74022 Rahlstedt",109.94682920503178,33.44,1672]
[null,null,null,"74023 Rahlstedt",73.29788613668785,33.44,1672]
[null,null,null,"74024 Rahlstedt",85.514200492802502,33.44,1672]
[null,null,null,"74025 Rahlstedt",48.865257424458569,33.44,1672]
[null,null,null,"74026 Rahlstedt",73.29788613668785,33.44,{"$f":"SUM(F772*50)","v":1672}]
[null,null,null,"74027 Rahlstedt",61.081571780573221,33.44,1672]
[null,null,null,"74028 Rahlstedt",85.514200492802502,33.44,1672]
[null,null,null,"74029 Rahlstedt",48.865257424458569,33.44,1672]
[null,null,null,"74030 Rahlstedt",73.29788613668785,33.44,1672]
[null,null,null,"74031 Rahlstedt",85.514200492802502,33.44,1672]
[null,null,null,"74032 Rahlstedt",73.29788613668785,33.44,1672]
[null,null,null,"74033 Rahlstedt",85.514200492802502,33.44,1672]
[null,null,null,"74034 Rahlstedt",73.29788613668785,33.44,1672]
[null,null,null,"74035 Rahlstedt",73.29788613668785,33.44,1672]
[null,null,null,"74036 Rahlstedt",85.514200492802502,33.44,1672]
[null,null,null,"74037 Rahlstedt",61.081571780573221,33.44,1672]
[null,null,null,"74038 Rahlstedt",36.648943068343925,33.44,1672]
[null,null,null,"75001 Lohbruegge",36.648943068343925,30.1,1505]
[null,null,null,"75002 Lohbruegge",61.081571780573221,30.1,1505]
[null,null,null,"75003 Lohbruegge",73.29788613668785,30.1,1505]
[null,null,null,"75004 Lohbruegge",48.865257424458569,30.1,1505]
[null,null,null,"75005 Lohbruegge",73.29788613668785,30.1,1505]
[null,null,null,"75006 Lohbruegge",73.29788613668785,30.1,1505]
[null,null,null,"75007 Lohbruegge",73.29788613668785,30.1,1505]
[null,null,null,"75008 Lohbruegge",85.514200492802502,30.1,1505]
[null,null,null,"75009 Lohbruegge",85.514200492802502,30.1,1505]
[null,null,null,"75010 Lohbruegge",73.29788613668785,30.1,1505]
[null,null,null,"75011 Lohbruegge",73.29788613668785,30.1,1505]
[null,null,null,"75012 Lohbruegge",85.514200492802502,30.1,1505]
[null,null,null,"75013 Lohbruegge",85.514200492802502,30.1,1505]
[null,null,null,"75014 Lohbruegge",61.081571780573221,30.1,1505]
[null,null,null,"75015 Lohbruegge",85.514200492802502,30.1,1505]
[null,null,null,"75016 Lohbruegge",61.081571780573221,30.1,1505]
[null,null,null,"75017 Lohbruegge",73.29788613668785,30.1,1505]
[null,null,null,"75018 Lohbruegge",134.37945791726108,30.1,1505]
[null,null,null,"75019 Lohbruegge",109.94682920503178,30.1,1505]
[null,null,null,"76001 Bergedorf",122.16314356114644,33.22,1661]
[null,null,null,"76002 Bergedorf",134.37945791726108,33.22,1661]
[null,null,null,"76003 Bergedorf",85.514200492802502,33.22,1661]
[null,null,null,"76004 Bergedorf",134.37945791726108,33.22,1661]
[null,null,null,"76005 Bergedorf",61.081571780573221,33.22,1661]
[null,null,null,"76006 Bergedorf",24.432628712229285,33.22,1661]
[null,null,null,"76007 Bergedorf",85.514200492802502,33.22,1661]
[null,null,null,"76008 Bergedorf",24.432628712229285,33.22,1661]
[null,null,null,"76010 Bergedorf",61.081571780573221,33.22,1661]
[null,null,null,"76011 Bergedorf",85.514200492802502,33.22,1661]
[null,null,null,"76012 Bergedorf",36.648943068343925,33.22,1661]
[null,null,null,"76013 Bergedorf",73.29788613668785,33.22,1661]
[null,null,null,"76014 Bergedorf",97.730514848917139,33.22,1661]
[null,null,null,"76015 Bergedorf",24.432628712229285,33.22,1661]
[null,null,null,"76016 Bergedorf",24.432628712229285,33.22,1661]
[null,null,null,"76017 Bergedorf",36.648943068343925,33.22,1661]
[null,null,null,"76018 Bergedorf",12.216314356114642,33.22,1661]
[null,null,null,"76024 Bergedorf",73.29788613668785,33.22,1661]
[null,null,null,"77001 Curslack",24.432628712229285,3.67,183.5]
[null,null,null,"78001 Altengamme",0,1.42,71]
[null,null,null,"79001 Neuengamme",24.432628712229285,1.97,98.5]
[null,null,null,"79002 Neuengamme",24.432628712229285,1.97,98.5]
[null,null,null,"80001 Kirchwerder",24.432628712229285,2.93,146.5]
[null,null,null,"80002 Kirchwerder",12.216314356114642,2.93,146.5]
[null,null,null,"80003 Kirchwerder",36.648943068343925,2.93,146.5]
[null,null,null,"80004 Kirchwerder",24.432628712229285,2.93,146.5]
[null,null,null,"81001 Ochsenwerder",12.216314356114642,1.8,90]
[null,null,null,"82001 Reitbrook",12.216314356114642,0.74,37]
[null,null,null,"83001 Allermoehe",0,1.6,80]
[null,null,null,"83003 Allermoehe",12.216314356114642,1.6,80]
[null,null,null,"84001 Billwerder",12.216314356114642,1.51,75.5]
[null,null,null,"84002 Billwerder",36.648943068343925,1.51,75.5]
[null,null,null,"85001 Moorfleet",0,2.95,{"$f":"SUM(F836*50)","v":147.5}]
[null,null,null,"85002 Moorfleet",0,2.95,147.5]
[null,null,null,"86001 Tatenberg",0,1.77,88.5]
[null,null,null,"87001 Spadenland",0,1.44,72]
[null,null,null,"88001 Harburg",122.16314356114644,64.8,3240]
[null,null,null,"88002 Harburg",61.081571780573221,64.8,3240]
[null,null,null,"88003 Harburg",73.29788613668785,64.8,3240]
[null,null,null,"88004 Harburg",146.5957722733757,64.8,3240]
[null,null,null,"88005 Harburg",146.5957722733757,64.8,3240]
[null,null,null,"88006 Harburg",171.028400985605,64.8,3240]
[null,null,null,"88007 Harburg",171.028400985605,64.8,3240]
[null,null,null,"88008 Harburg",109.94682920503178,64.8,3240]
[null,null,null,"88009 Harburg",146.5957722733757,64.8,3240]
[null,null,null,"88010 Harburg",109.94682920503178,64.8,3240]
[null,null,null,"89001 Neuland",24.432628712229285,1.71,85.5]
[null,null,null,"89002 Neuland",12.216314356114642,1.71,85.5]
[null,null,null,"89003 Neuland",24.432628712229285,1.71,85.5]
[null,null,null,"89004 Neuland",24.432628712229285,1.71,85.5]
[null,null,null,"90001 GutMoor",12.216314356114642,1.71,85.5]
[null,null,null,"91001 Wilstorf",61.081571780573221,47.91,2395.5]
[null,null,null,"91002 Wilstorf",73.29788613668785,47.91,2395.5]
[null,null,null,"91003 Wilstorf",97.730514848917139,47.91,2395.5]
[null,null,null,"91004 Wilstorf",73.29788613668785,47.91,2395.5]
[null,null,null,"91005 Wilstorf",73.29788613668785,47.91,2395.5]
[null,null,null,"91006 Wilstorf",61.081571780573221,47.91,2395.5]
[null,null,null,"91007 Wilstorf",85.514200492802502,47.91,2395.5]
[null,null,null,"92001 Roenneburg",24.432628712229285,14.13,706.5]
[null,null,null,"93001 Langenbek",73.29788613668785,48.48,2424]
[null,null,null,"94001 Sinstorf",24.432628712229285,14.12,706]
[null,null,null,"94002 Sinstorf",36.648943068343925,14.12,706]
[null,null,null,"95001 Marmstorf",73.29788613668785,15.17,758.5]
[null,null,null,"95002 Marmstorf",24.432628712229285,15.17,758.5]
[null,null,null,"95003 Marmstorf",48.865257424458569,15.17,758.5]
[null,null,null,"95004 Marmstorf",36.648943068343925,15.17,758.5]
[null,null,null,"95005 Marmstorf",48.865257424458569,15.17,758.5]
[null,null,null,"96001 Eißendorf",85.514200492802502,28.79,1439.5]
[null,null,null,"96002 Eißendorf",122.16314356114644,28.79,1439.5]
[null,null,null,"96003 Eißendorf",61.081571780573221,28.79,1439.5]
[null,null,null,"96004 Eißendorf",134.37945791726108,28.79,1439.5]
[null,null,null,"96005 Eißendorf",73.29788613668785,28.79,1439.5]
[null,null,null,"96006 Eißendorf",24.432628712229285,28.79,1439.5]
[null,null,null,"96007 Eißendorf",73.29788613668785,28.79,1439.5]
[null,null,null,"96008 Eißendorf",85.514200492802502,28.79,1439.5]
[null,null,null,"96009 Eißendorf",61.081571780573221,28.79,1439.5]
[null,null,null,"96010 Eißendorf",73.29788613668785,28.79,1439.5]
[null,null,null,"96011 Eißendorf",12.216314356114642,28.79,1439.5]
[null,null,null,"97001 Heimfeld",12.216314356114642,18.3,915]
[null,null,null,"97002 Heimfeld",24.432628712229285,18.3,915]
[null,null,null,"97003 Heimfeld",48.865257424458569,18.3,915]
[null,null,null,"97004 Heimfeld",12.216314356114642,18.3,915]
[null,null,null,"97005 Heimfeld",24.432628712229285,18.3,915]
[null,null,null,"97006 Heimfeld",73.29788613668785,18.3,915]
[null,null,null,"97007 Heimfeld",122.16314356114644,18.3,915]
[null,null,null,"97008 Heimfeld",122.16314356114644,18.3,915]
[null,null,null,"97009 Heimfeld",146.5957722733757,18.3,915]
[null,null,null,"97010 Heimfeld",97.730514848917139,18.3,915]
[null,null,null,"97011 Heimfeld",183.24471534171965,18.3,915]
[null,null,null,"98001 Moorburg",0,0.44,22]
[null,null,null,"98002 Moorburg",12.216314356114642,0.44,22]
[null,null,null,"98003 Moorburg",12.216314356114642,0.44,22]
[null,null,null,"99001 Altenwerder",12.216314356114642,0.44,22]
[null,null,null,"99002 Altenwerder",12.216314356114642,0.44,22]
[null,null,null,"100001 Hausbruch",24.432628712229285,15.07,753.5]
[null,null,null,"100002 Hausbruch",24.432628712229285,15.07,753.5]
[null,null,null,"100003 Hausbruch",36.648943068343925,15.07,{"$f":"SUM(F900*50)","v":753.5}]
[null,null,null,"100004 Hausbruch",97.730514848917139,15.07,753.5]
[null,null,null,"100005 Hausbruch",61.081571780573221,15.07,753.5]
[null,null,null,"100006 Hausbruch",36.648943068343925,15.07,753.5]
[null,null,null,"100007 Hausbruch",122.16314356114644,15.07,753.5]
[null,null,null,"100008 Hausbruch",61.081571780573221,15.07,753.5]
[null,null,null,"100009 Hausbruch",24.432628712229285,15.07,753.5]
[null,null,null,"100010 Hausbruch",24.432628712229285,15.07,753.5]
[null,null,null,"101001 Neugraben-Fischbek",24.432628712229285,12.38,619]
[null,null,null,"101002 Neugraben-Fischbek",24.432628712229285,12.38,619]
[null,null,null,"101003 Neugraben-Fischbek",36.648943068343925,12.38,619]
[null,null,null,"101004 Neugraben-Fischbek",109.94682920503178,12.38,619]
[null,null,null,"101005 Neugraben-Fischbek",24.432628712229285,12.38,619]
[null,null,null,"101006 Neugraben-Fischbek",73.29788613668785,12.38,619]
[null,null,null,"101007 Neugraben-Fischbek",109.94682920503178,12.38,619]
[null,null,null,"101008 Neugraben-Fischbek",36.648943068343925,12.38,619]
[null,null,null,"101009 Neugraben-Fischbek",61.081571780573221,12.38,619]
[null,null,null,"101010 Neugraben-Fischbek",48.865257424458569,12.38,619]
[null,null,null,"101011 Neugraben-Fischbek",85.514200492802502,12.38,619]
[null,null,null,"101012 Neugraben-Fischbek",85.514200492802502,12.38,619]
[null,null,null,"101013 Neugraben-Fischbek",109.94682920503178,12.38,619]
[null,null,null,"101014 Neugraben-Fischbek",61.081571780573221,12.38,619]
[null,null,null,"101015 Neugraben-Fischbek",24.432628712229285,12.38,619]
[null,null,null,"101016 Neugraben-Fischbek",24.432628712229285,12.38,619]
[null,null,null,"102001 Francop",0,0.78,39]
[null,null,null,"103001 Neuenfelde",0,3,150]
[null,null,null,"103002 Neuenfelde",48.865257424458569,3,150]
[null,null,null,"103003 Neuenfelde",0,3,150]
[null,null,null,"103004 Neuenfelde",0,3,150]
[null,null,null,"104001 Cranz",0,5.77,288.5]
[null,null,null,"105001 INSELNEUWERK",0,4.4736842105263158E-2,2.236842105263158]
[null,null,null,"107001 Neuallermoehe",36.648943068343925,56.79,2839.5]
[null,null,null,"107002 Neuallermoehe",109.94682920503178,56.79,2839.5]
[null,null,null,"107003 Neuallermoehe",48.865257424458569,56.79,2839.5]
[null,null,null,"107004 Neuallermoehe",73.29788613668785,56.79,2839.5]
[null,null,null,"107005 Neuallermoehe",146.5957722733757,56.79,2839.5]
[null,null,null,"107006 Neuallermoehe",146.5957722733757,56.79,2839.5]
[null,null,null,"107007 Neuallermoehe",61.081571780573221,56.79,2839.5]
[null,null,null,"107008 Neuallermoehe",134.37945791726108,56.79,2839.5]
[null,null,null,"107009 Neuallermoehe",36.648943068343925,56.79,2839.5]
[null,null,null,"107010 Neuallermoehe",134.37945791726108,56.79,2839.5]
[null,null,null,"107011 Neuallermoehe",85.514200492802502,56.79,2839.5]
[null,null,null,"107012 Neuallermoehe",134.37945791726108,56.79,2839.5]
[null,null,null,"107013 Neuallermoehe",109.94682920503178,56.79,2839.5]
[null,null,null,"107014 Neuallermoehe",85.514200492802502,56.79,2839.5]
[null,null,null,"107015 Neuallermoehe",48.865257424458569,56.79,2839.5]

{"sheet":"Daten Bewohnerstruktur","index":2,"n_rows":26,"n_cols":23,"rows_kept":26,"cut":false,"hidden":true,"merged":[[27,5,27,11],[28,6,28,11],[1,12,1,13]]}
[]
[null,"Wohnungsgröße",null,"Durchschnittliche Bewohner",null,"Wohnungstyp","Code","Faktor",null,"Belegungsdichte",null,null,"Haushaltstyp",null,"Code",null,"Schlüssel Bewohner CS-Anteil",null,"Nutzer je CS-Fz",null,"Nutzer je CS-Fz","Potentialgruppe in Bezug auf Haushaltstyp","Anteil CS-Nutzer in Bezug auf Wohnungstyp"]
[null,null,0,0,null,null," "," ",null," "," ","Personen"," ",null," ",null," "," ",null,null," "]
[null,"1-2 Zimmer-Wohnung (< 60 m²)",1,1,null,"Gefördert",10,1.5,null,11,{"$f":"TRUNC(SUM(D4*$H$4),1)","v":1.5},"Personen",1,"Single",1,null,11,{"$f":"SUM(V4*W4*TOOL!G83)","v":2.6099999999999998E-2},15,"-",45,0.87,0.03]
[null,"3 Zimmer-Wohnung (60 - 85 m²)",2,1.5,null,"Frei finanziert",20,1.3,null,12,{"$f":"TRUNC(SUM(D5*$H$4),1)","v":2.2000000000000002},"Personen",1.3,"Single",1,null,12,{"$f":"SUM(V5*W5*TOOL!G83)","v":2.4E-2},15,"-",45,0.8,0.03]
[null,"4 Zimmer-Wohnung (85 - 95 m²)",3,2.5,null,"Eigentum",30,1,null,13,3.7,"Personen",1.5,"Paar",2,null,13,{"$f":"SUM(V6*W6*TOOL!G83)","v":1.4999999999999999E-2},15,"-",45,0.5,0.03]
[null,"5 (+) Zimmer-Wohnung (> 105 m²)",4,3.5,null,null,null,null,null,14,5.2,"Personen",1.9,"Paar",2,null,21,{"$f":"SUM(V7*W7*TOOL!G83)","v":8.7000000000000008E-2},15,"-",45,0.87,0.1]
[null,null,null,null,null,null,null,null,null,null,null,null,2.2000000000000002,"Paar",2,null,22,{"$f":"SUM(V8*W8*TOOL!G83)","v":8.0000000000000016E-2},15,"-",45,0.8,0.1]
[null,null,null,null,null,null,null,null,null,21,{"$f":"TRUNC(SUM(D4*$H$5),1)","v":1.3},"Personen",2.5,"Familie",3,null,23,{"$f":"SUM(V9*W9*TOOL!G83)","v":0.05},15,"-",45,0.5,0.1]
[null,null,null,null,null,null,null,null,null,22,{"$f":"TRUNC(SUM(D5*$H$5),1)","v":1.9},"Personen",3.2,"Familie",3,null,31,{"$f":"SUM(V10*W10*TOOL!G83)","v":8.7000000000000008E-2},15,"-",45,0.87,0.1]
[null,null,null,null,null,null,null,null,null,23,3.2,"Personen",3.5,"Familie",3,null,32,{"$f":"SUM(V11*W11*TOOL!G83)","v":8.0000000000000016E-2},15,"-",45,0.8,0.1]
[null,null,null,null,null,null,null,null,null,24,4.5,"Personen",3.7,"Familie",3,null,33,{"$f":"SUM(V12*W12*TOOL!G83)","v":0.05},15,"-",45,0.5,0.1]
[null,"Sonstiger Wohnungstyp","Schlüssel Bewohner",null,null,null,null,null,null,null,null,null,3.9,"Familie",3]
[null,null,null,null,null,null,null,null,null,31,{"$f":"TRUNC(SUM(D4*$H$6),1)","v":1},"Personen",4.5,"Familie",3]
[null,"Studentenwohnheim",0.2,15,"-",45,null,null,null,32,{"$f":"TRUNC(SUM(D5*$H$6),1)","v":1.5},"Personen",5.2,"Familie",3]
[null,"Kinder- und Jugendwohnheim",0,15,"-",45,null,null,null,33,2.5,"Personen"]
[null,"Altenwohnheim",5.0000000000000001E-3,15,"-",45,null,null,null,34,3.5,"Personen"]
[null,"Pflegeheim",0,15,"-",45]
[]
[]
[null,null,null,null,null,"Maßnahmen flankierende Maßnahmen","Faktor"]
[null,null,null,null,null,null,0]
[null,null,null,null,null,"Neubürgerpaket/Informationsleitsystem",0.3]
[null,null,null,null,null,"hochwertige Fahrradabstellanlagen",0.1]
[null,null,null,null,null,"Mobilitätsstation",0.2]
[null,null,null,null,null,"ergänzende StadtRad-Station",0.05]